null
SMILES: COc1ccc(COc2ccc(cc2OC)C(=O)\C=C\c2cc(OC)c(OC)c(OC)c2)cc1OC
InChI Key: InChIKey=ZAAOHJLHBVUEAE-JXMROGBWSA-N
Activity Spreadsheet -- Enzyme Inhibition Constant Data from BindingDB
Found 1 hit for monomerid = 50141527
Trg + Lig
Ki
nM
ΔG°
kcal/mole
IC50
nM
Kd
nM
EC50/IC50
nM
koff
s-1
kon
M-1s-1
pHTemp
°C
Tumor necrosis factor receptor superfamily member 1A
(Homo sapiens (Human))
BDBM50141527
((E)-1-[4-(3,4-Dimethoxy-benzyloxy)-3-methoxy-pheny...)
Show SMILES COc1ccc(COc2ccc(cc2OC)C(=O)\C=C\c2cc(OC)c(OC)c(OC)c2)cc1OC
Show InChI InChI=1S/C28H30O8/c1-30-22-11-8-19(15-24(22)31-2)17-36-23-12-9-20(16-25(23)32-3)21(29)10-7-18-13-26(33-4)28(35-6)27(14-18)34-5/h7-16H,17H2,1-6H3/b10-7+
NCI pathway
Reactome pathway
n/an/a 2.00E+3n/an/an/an/an/an/a
AtheroGenics, Inc.
Curated by ChEMBL
Assay Description
Inhibition of TNF-alpha-induced VCAM-1 expression
Bioorg Med Chem Lett 14: 1513-7 (2004)
Article DOI: 10.1016/j.bmcl.2004.01.021
BindingDB Entry DOI: 10.7270/Q2028QZK