BDBM50141845 (R)-2-((3S,4S)-3-((4-(3-benzyl-1H-pyrazol-5-yl)piperidin-1-yl)methyl)-4-phenylpyrrolidin-1-yl)-2-cyclohexylacetic acid::CHEMBL172659::{3-[4-(5-Benzyl-2H-pyrazol-3-yl)-piperidin-1-ylmethyl]-4-phenyl-pyrrolidin-1-yl}-cyclohexyl-acetic acid
SMILES: OC(=O)[C@@H](C1CCCCC1)N1C[C@H](CN2CCC(CC2)c2cc(Cc3ccccc3)[nH]n2)[C@H](C1)c1ccccc1
InChI Key: InChIKey=QAIJWPOWXKGVJQ-KCTCJIHVSA-N
Data: 2 IC50
Activity Spreadsheet -- Enzyme Inhibition Constant Data from BindingDB
Found 2 hits for monomerid = 50141845
Trg + Lig
Ki
nM
ΔG°
kcal/mole
IC50
nM
Kd
nM
EC50/IC50
nM
koff
s-1
kon
M-1s-1
pHTemp
°C
C-C chemokine receptor type 5
(Homo sapiens (Human))
BDBM50141845
((R)-2-((3S,4S)-3-((4-(3-benzyl-1H-pyrazol-5-yl)pip...)
Show SMILES OC(=O)[C@@H](C1CCCCC1)N1C[C@H](CN2CCC(CC2)c2cc(Cc3ccccc3)[nH]n2)[C@H](C1)c1ccccc1 |r|
Show InChI InChI=1S/C34H44N4O2/c39-34(40)33(28-14-8-3-9-15-28)38-23-29(31(24-38)26-12-6-2-7-13-26)22-37-18-16-27(17-19-37)32-21-30(35-36-32)20-25-10-4-1-5-11-25/h1-2,4-7,10-13,21,27-29,31,33H,3,8-9,14-20,22-24H2,(H,35,36)(H,39,40)/t29-,31+,33+/m0/s1
n/an/a 2.20n/an/an/an/an/an/a
Beijing University of Technology
Curated by ChEMBL
Assay Description
Displacement of [125I]MIP1alpha from human CCR5 expressed in CHO cells
Eur J Med Chem 43: 2724-34 (2008)
Article DOI: 10.1016/j.ejmech.2008.01.040
BindingDB Entry DOI: 10.7270/Q2G44Q3W
C-C chemokine receptor type 5
(Homo sapiens (Human))
BDBM50141845
((R)-2-((3S,4S)-3-((4-(3-benzyl-1H-pyrazol-5-yl)pip...)
Show SMILES OC(=O)[C@@H](C1CCCCC1)N1C[C@H](CN2CCC(CC2)c2cc(Cc3ccccc3)[nH]n2)[C@H](C1)c1ccccc1 |r|
Show InChI InChI=1S/C34H44N4O2/c39-34(40)33(28-14-8-3-9-15-28)38-23-29(31(24-38)26-12-6-2-7-13-26)22-37-18-16-27(17-19-37)32-21-30(35-36-32)20-25-10-4-1-5-11-25/h1-2,4-7,10-13,21,27-29,31,33H,3,8-9,14-20,22-24H2,(H,35,36)(H,39,40)/t29-,31+,33+/m0/s1
n/an/a 2.20n/an/an/an/an/an/a
Merck Research Laboratories
Curated by ChEMBL
Assay Description
Inhibitory activity against human CC chemokine receptor 5
Bioorg Med Chem Lett 14: 935-9 (2004)
Article DOI: 10.1016/j.bmcl.2003.12.004
BindingDB Entry DOI: 10.7270/Q2PK0FKP