BDBM50142048 (S)-2-[(1-Cyclohexyl-2-furan-3-yl-1H-benzoimidazole-5-carbonyl)-amino]-3-(5-trifluoromethanesulfonylamino-1H-indol-3-yl)-propionic acid::CHEMBL368852
SMILES: OC(=O)[C@H](Cc1c[nH]c2ccc(NS(=O)(=O)C(F)(F)F)cc12)NC(=O)c1ccc2n(C3CCCCC3)c(nc2c1)-c1ccoc1
InChI Key: InChIKey=PYQMCPAHUMCVIU-VWLOTQADSA-N
Data: 3 IC50
Activity Spreadsheet -- Enzyme Inhibition Constant Data from BindingDB
Found 3 hits for monomerid = 50142048
Trg + Lig
Ki
nM
ΔG°
kcal/mole
IC50
nM
Kd
nM
EC50/IC50
nM
koff
s-1
kon
M-1s-1
pHTemp
°C
RNA polymerase subunit beta (β-RNAP)
(Escherichia coli)
BDBM50142048
((S)-2-[(1-Cyclohexyl-2-furan-3-yl-1H-benzoimidazol...)
Show SMILES OC(=O)[C@H](Cc1c[nH]c2ccc(NS(=O)(=O)C(F)(F)F)cc12)NC(=O)c1ccc2n(C3CCCCC3)c(nc2c1)-c1ccoc1
Show InChI InChI=1S/C30H28F3N5O6S/c31-30(32,33)45(42,43)37-20-7-8-23-22(14-20)19(15-34-23)13-25(29(40)41)36-28(39)17-6-9-26-24(12-17)35-27(18-10-11-44-16-18)38(26)21-4-2-1-3-5-21/h6-12,14-16,21,25,34,37H,1-5,13H2,(H,36,39)(H,40,41)/t25-/m0/s1
n/an/a>2.50E+5n/an/an/an/an/an/a
Boehringer Ingelheim (Canada) Ltd
Curated by ChEMBL
Assay Description
Concentration required to inhibit RNA dependent RNA polymerase was determined from polio virus
Bioorg Med Chem Lett 14: 967-71 (2004)
Article DOI: 10.1016/j.bmcl.2003.12.032
BindingDB Entry DOI: 10.7270/Q29C6WVF
Bacterial DNA-directed RNA polymerase
(Escherichia coli)
BDBM50142048
((S)-2-[(1-Cyclohexyl-2-furan-3-yl-1H-benzoimidazol...)
Show SMILES OC(=O)[C@H](Cc1c[nH]c2ccc(NS(=O)(=O)C(F)(F)F)cc12)NC(=O)c1ccc2n(C3CCCCC3)c(nc2c1)-c1ccoc1
Show InChI InChI=1S/C30H28F3N5O6S/c31-30(32,33)45(42,43)37-20-7-8-23-22(14-20)19(15-34-23)13-25(29(40)41)36-28(39)17-6-9-26-24(12-17)35-27(18-10-11-44-16-18)38(26)21-4-2-1-3-5-21/h6-12,14-16,21,25,34,37H,1-5,13H2,(H,36,39)(H,40,41)/t25-/m0/s1
n/an/a>2.50E+5n/an/an/an/an/an/a
Boehringer Ingelheim (Canada) Ltd
Curated by ChEMBL
Assay Description
Concentration required to inhibit RNA dependent RNA polymerase was determined from polio virus
Bioorg Med Chem Lett 14: 967-71 (2004)
Article DOI: 10.1016/j.bmcl.2003.12.032
BindingDB Entry DOI: 10.7270/Q29C6WVF
Hepatitis C virus NS5B RNA-dependent RNA polymerase
(Hepatitis C virus)
BDBM50142048
((S)-2-[(1-Cyclohexyl-2-furan-3-yl-1H-benzoimidazol...)
Show SMILES OC(=O)[C@H](Cc1c[nH]c2ccc(NS(=O)(=O)C(F)(F)F)cc12)NC(=O)c1ccc2n(C3CCCCC3)c(nc2c1)-c1ccoc1
Show InChI InChI=1S/C30H28F3N5O6S/c31-30(32,33)45(42,43)37-20-7-8-23-22(14-20)19(15-34-23)13-25(29(40)41)36-28(39)17-6-9-26-24(12-17)35-27(18-10-11-44-16-18)38(26)21-4-2-1-3-5-21/h6-12,14-16,21,25,34,37H,1-5,13H2,(H,36,39)(H,40,41)/t25-/m0/s1
n/an/a 150n/an/an/an/an/an/a
Boehringer Ingelheim (Canada) Ltd
Curated by ChEMBL
Assay Description
Concentration required for inhibiting hepatitis C virus NS5B RNA polymerase activity.
Bioorg Med Chem Lett 14: 967-71 (2004)
Article DOI: 10.1016/j.bmcl.2003.12.032
BindingDB Entry DOI: 10.7270/Q29C6WVF