BDBM50142050 (S)-2-(1-cyclohexyl-2-(pyridin-2-yl)-1H-benzo[d]imidazole-5-carboxamido)-3-(5-hydroxy-1H-indol-3-yl)propanoic acid::(S)-2-[(1-Cyclohexyl-2-pyridin-2-yl-1H-benzoimidazole-5-carbonyl)-amino]-3-(5-hydroxy-1H-indol-3-yl)-propionic acid::CHEMBL367430
SMILES: OC(=O)[C@H](Cc1c[nH]c2ccc(O)cc12)NC(=O)c1ccc2n(C3CCCCC3)c(nc2c1)-c1ccccn1
InChI Key: InChIKey=MEZMMRWPFKWMJY-SANMLTNESA-N
Data: 1 IC50
Activity Spreadsheet -- Enzyme Inhibition Constant Data from BindingDB
Found 1 hit for monomerid = 50142050
Trg + Lig
Ki
nM
ΔG°
kcal/mole
IC50
nM
Kd
nM
EC50/IC50
nM
koff
s-1
kon
M-1s-1
pHTemp
°C
Hepatitis C virus NS5B RNA-dependent RNA polymerase
(Hepatitis C virus)
BDBM50142050
((S)-2-(1-cyclohexyl-2-(pyridin-2-yl)-1H-benzo[d]im...)
Show SMILES OC(=O)[C@H](Cc1c[nH]c2ccc(O)cc12)NC(=O)c1ccc2n(C3CCCCC3)c(nc2c1)-c1ccccn1
Show InChI InChI=1S/C30H29N5O4/c36-21-10-11-23-22(16-21)19(17-32-23)15-26(30(38)39)34-29(37)18-9-12-27-25(14-18)33-28(24-8-4-5-13-31-24)35(27)20-6-2-1-3-7-20/h4-5,8-14,16-17,20,26,32,36H,1-3,6-7,15H2,(H,34,37)(H,38,39)/t26-/m0/s1
n/an/a 140n/an/an/an/an/an/a
Boehringer Ingelheim (Canada) Ltd
Curated by ChEMBL
Assay Description
Concentration required for inhibiting hepatitis C virus NS5B RNA polymerase activity.
Bioorg Med Chem Lett 14: 967-71 (2004)
Article DOI: 10.1016/j.bmcl.2003.12.032
BindingDB Entry DOI: 10.7270/Q29C6WVF