BDBM50142056 (S)-3-(5-Carbamoyl-1H-indol-3-yl)-2-[(1-cyclohexyl-2-furan-3-yl-1H-benzoimidazole-5-carbonyl)-amino]-propionic acid::CHEMBL424769
SMILES: NC(=O)c1ccc2[nH]cc(C[C@H](NC(=O)c3ccc4n(C5CCCCC5)c(nc4c3)-c3ccoc3)C(O)=O)c2c1
InChI Key: InChIKey=ZHQUMMFTPJTJLC-VWLOTQADSA-N
Data: 3 IC50
Activity Spreadsheet -- Enzyme Inhibition Constant Data from BindingDB
Found 3 hits for monomerid = 50142056
Trg + Lig
Ki
nM
ΔG°
kcal/mole
IC50
nM
Kd
nM
EC50/IC50
nM
koff
s-1
kon
M-1s-1
pHTemp
°C
RNA polymerase subunit beta (β-RNAP)
(Escherichia coli)
BDBM50142056
((S)-3-(5-Carbamoyl-1H-indol-3-yl)-2-[(1-cyclohexyl...)
Show SMILES NC(=O)c1ccc2[nH]cc(C[C@H](NC(=O)c3ccc4n(C5CCCCC5)c(nc4c3)-c3ccoc3)C(O)=O)c2c1
Show InChI InChI=1S/C30H29N5O5/c31-27(36)17-6-8-23-22(12-17)20(15-32-23)14-25(30(38)39)34-29(37)18-7-9-26-24(13-18)33-28(19-10-11-40-16-19)35(26)21-4-2-1-3-5-21/h6-13,15-16,21,25,32H,1-5,14H2,(H2,31,36)(H,34,37)(H,38,39)/t25-/m0/s1
n/an/a>2.00E+5n/an/an/an/an/an/a
Boehringer Ingelheim (Canada) Ltd
Curated by ChEMBL
Assay Description
Concentration required to inhibit RNA dependent RNA polymerase was determined from polio virus
Bioorg Med Chem Lett 14: 967-71 (2004)
Article DOI: 10.1016/j.bmcl.2003.12.032
BindingDB Entry DOI: 10.7270/Q29C6WVF
Bacterial DNA-directed RNA polymerase
(Escherichia coli)
BDBM50142056
((S)-3-(5-Carbamoyl-1H-indol-3-yl)-2-[(1-cyclohexyl...)
Show SMILES NC(=O)c1ccc2[nH]cc(C[C@H](NC(=O)c3ccc4n(C5CCCCC5)c(nc4c3)-c3ccoc3)C(O)=O)c2c1
Show InChI InChI=1S/C30H29N5O5/c31-27(36)17-6-8-23-22(12-17)20(15-32-23)14-25(30(38)39)34-29(37)18-7-9-26-24(13-18)33-28(19-10-11-40-16-19)35(26)21-4-2-1-3-5-21/h6-13,15-16,21,25,32H,1-5,14H2,(H2,31,36)(H,34,37)(H,38,39)/t25-/m0/s1
n/an/a>2.50E+5n/an/an/an/an/an/a
Boehringer Ingelheim (Canada) Ltd
Curated by ChEMBL
Assay Description
Concentration required to inhibit RNA dependent RNA polymerase was determined from polio virus
Bioorg Med Chem Lett 14: 967-71 (2004)
Article DOI: 10.1016/j.bmcl.2003.12.032
BindingDB Entry DOI: 10.7270/Q29C6WVF
Hepatitis C virus NS5B RNA-dependent RNA polymerase
(Hepatitis C virus)
BDBM50142056
((S)-3-(5-Carbamoyl-1H-indol-3-yl)-2-[(1-cyclohexyl...)
Show SMILES NC(=O)c1ccc2[nH]cc(C[C@H](NC(=O)c3ccc4n(C5CCCCC5)c(nc4c3)-c3ccoc3)C(O)=O)c2c1
Show InChI InChI=1S/C30H29N5O5/c31-27(36)17-6-8-23-22(12-17)20(15-32-23)14-25(30(38)39)34-29(37)18-7-9-26-24(13-18)33-28(19-10-11-40-16-19)35(26)21-4-2-1-3-5-21/h6-13,15-16,21,25,32H,1-5,14H2,(H2,31,36)(H,34,37)(H,38,39)/t25-/m0/s1
n/an/a 37n/an/an/an/an/an/a
Boehringer Ingelheim (Canada) Ltd
Curated by ChEMBL
Assay Description
Concentration required for inhibiting hepatitis C virus NS5B RNA polymerase activity.
Bioorg Med Chem Lett 14: 967-71 (2004)
Article DOI: 10.1016/j.bmcl.2003.12.032
BindingDB Entry DOI: 10.7270/Q29C6WVF