BDBM50142089 3'-Carbamimidoyl-biphenyl-4-carboxylic acid [4-chloro-2-(5-chloro-pyridin-2-ylcarbamoyl)-phenyl]-amide::CHEMBL174335
SMILES: NC(=N)c1cccc(c1)-c1ccc(cc1)C(=O)Nc1ccc(Cl)cc1C(=O)Nc1ccc(Cl)cn1
InChI Key: InChIKey=KUZWQHAZGZZCGJ-UHFFFAOYSA-N
Data: 1 KI  1 IC50
Activity Spreadsheet -- Enzyme Inhibition Constant Data from BindingDB
Found 2 hits for monomerid = 50142089
Trg + Lig
Ki
nM
ΔG°
kcal/mole
IC50
nM
Kd
nM
EC50/IC50
nM
koff
s-1
kon
M-1s-1
pHTemp
°C
Coagulation factor X
(Homo sapiens (Human))
BDBM50142089
(3'-Carbamimidoyl-biphenyl-4-carboxylic acid [4-chl...)
Show SMILES NC(=N)c1cccc(c1)-c1ccc(cc1)C(=O)Nc1ccc(Cl)cc1C(=O)Nc1ccc(Cl)cn1
Show InChI InChI=1S/C26H19Cl2N5O2/c27-19-8-10-22(21(13-19)26(35)33-23-11-9-20(28)14-31-23)32-25(34)16-6-4-15(5-7-16)17-2-1-3-18(12-17)24(29)30/h1-14H,(H3,29,30)(H,32,34)(H,31,33,35)
Reactome pathway
0.700n/an/an/an/an/an/an/an/a
Millennium Pharmaceuticals, Inc.
Curated by ChEMBL
Assay Description
Inhibition of Coagulation factor X
Bioorg Med Chem Lett 14: 983-7 (2004)
Article DOI: 10.1016/j.bmcl.2003.11.079
BindingDB Entry DOI: 10.7270/Q21V5DF7
Coagulation factor X
(Homo sapiens (Human))
BDBM50142089
(3'-Carbamimidoyl-biphenyl-4-carboxylic acid [4-chl...)
Show SMILES NC(=N)c1cccc(c1)-c1ccc(cc1)C(=O)Nc1ccc(Cl)cc1C(=O)Nc1ccc(Cl)cn1
Show InChI InChI=1S/C26H19Cl2N5O2/c27-19-8-10-22(21(13-19)26(35)33-23-11-9-20(28)14-31-23)32-25(34)16-6-4-15(5-7-16)17-2-1-3-18(12-17)24(29)30/h1-14H,(H3,29,30)(H,32,34)(H,31,33,35)
Reactome pathway
n/an/a 1.60n/an/an/an/an/an/a
Millennium Pharmaceuticals, Inc.
Curated by ChEMBL
Assay Description
Inhibition of Coagulation factor X
Bioorg Med Chem Lett 14: 983-7 (2004)
Article DOI: 10.1016/j.bmcl.2003.11.079
BindingDB Entry DOI: 10.7270/Q21V5DF7