BDBM50142123 3'-Morpholin-4-yl-biphenyl-4-carboxylic acid [4-chloro-2-(5-chloro-pyridin-2-ylcarbamoyl)-phenyl]-amide::CHEMBL177996
SMILES: Clc1ccc(NC(=O)c2cc(Cl)ccc2NC(=O)c2ccc(cc2)-c2cccc(c2)N2CCOCC2)nc1
InChI Key: InChIKey=KBTOQMXKLGQJMF-UHFFFAOYSA-N
Data: 1 IC50
Activity Spreadsheet -- Enzyme Inhibition Constant Data from BindingDB
Found 1 hit for monomerid = 50142123
Trg + Lig
Ki
nM
ΔG°
kcal/mole
IC50
nM
Kd
nM
EC50/IC50
nM
koff
s-1
kon
M-1s-1
pHTemp
°C
Coagulation factor X
(Homo sapiens (Human))
BDBM50142123
(3'-Morpholin-4-yl-biphenyl-4-carboxylic acid [4-ch...)
Show SMILES Clc1ccc(NC(=O)c2cc(Cl)ccc2NC(=O)c2ccc(cc2)-c2cccc(c2)N2CCOCC2)nc1
Show InChI InChI=1S/C29H24Cl2N4O3/c30-22-8-10-26(25(17-22)29(37)34-27-11-9-23(31)18-32-27)33-28(36)20-6-4-19(5-7-20)21-2-1-3-24(16-21)35-12-14-38-15-13-35/h1-11,16-18H,12-15H2,(H,33,36)(H,32,34,37)
Reactome pathway
n/an/a 74n/an/an/an/an/an/a
Millennium Pharmaceuticals, Inc.
Curated by ChEMBL
Assay Description
Inhibitory concentration against coagulation factor Xa.
Bioorg Med Chem Lett 14: 983-7 (2004)
Article DOI: 10.1016/j.bmcl.2003.11.079
BindingDB Entry DOI: 10.7270/Q21V5DF7