BDBM50142128 4'-(N,N-Dimethyl-carbamimidoyl)-biphenyl-4-carboxylic acid [4-chloro-2-(5-chloro-pyridin-2-ylcarbamoyl)-phenyl]-amide::CHEMBL369084
SMILES: CN(C)C(=N)c1ccc(cc1)-c1ccc(cc1)C(=O)Nc1ccc(Cl)cc1C(=O)Nc1ccc(Cl)cn1
InChI Key: InChIKey=NJCWRUFKIIYUGD-UHFFFAOYSA-N
Data: 1 IC50
Activity Spreadsheet -- Enzyme Inhibition Constant Data from BindingDB
Found 1 hit for monomerid = 50142128
Trg + Lig
Ki
nM
ΔG°
kcal/mole
IC50
nM
Kd
nM
EC50/IC50
nM
koff
s-1
kon
M-1s-1
pHTemp
°C
Coagulation factor X
(Homo sapiens (Human))
BDBM50142128
(4'-(N,N-Dimethyl-carbamimidoyl)-biphenyl-4-carboxy...)
Show SMILES CN(C)C(=N)c1ccc(cc1)-c1ccc(cc1)C(=O)Nc1ccc(Cl)cc1C(=O)Nc1ccc(Cl)cn1
Show InChI InChI=1S/C28H23Cl2N5O2/c1-35(2)26(31)19-7-3-17(4-8-19)18-5-9-20(10-6-18)27(36)33-24-13-11-21(29)15-23(24)28(37)34-25-14-12-22(30)16-32-25/h3-16,31H,1-2H3,(H,33,36)(H,32,34,37)
Reactome pathway
n/an/a 60n/an/an/an/an/an/a
Millennium Pharmaceuticals, Inc.
Curated by ChEMBL
Assay Description
Inhibitory concentration against coagulation factor Xa.
Bioorg Med Chem Lett 14: 983-7 (2004)
Article DOI: 10.1016/j.bmcl.2003.11.079
BindingDB Entry DOI: 10.7270/Q21V5DF7