BDBM50142130 3'-Amino-biphenyl-4-carboxylic acid [4-chloro-2-(5-chloro-pyridin-2-ylcarbamoyl)-phenyl]-amide::CHEMBL355573
SMILES: Nc1cccc(c1)-c1ccc(cc1)C(=O)Nc1ccc(Cl)cc1C(=O)Nc1ccc(Cl)cn1
InChI Key: InChIKey=SWNZMMHZUDGWJC-UHFFFAOYSA-N
Data: 1 IC50
Activity Spreadsheet -- Enzyme Inhibition Constant Data from BindingDB
Found 1 hit for monomerid = 50142130
Trg + Lig
Ki
nM
ΔG°
kcal/mole
IC50
nM
Kd
nM
EC50/IC50
nM
koff
s-1
kon
M-1s-1
pHTemp
°C
Coagulation factor X
(Homo sapiens (Human))
BDBM50142130
(3'-Amino-biphenyl-4-carboxylic acid [4-chloro-2-(5...)
Show SMILES Nc1cccc(c1)-c1ccc(cc1)C(=O)Nc1ccc(Cl)cc1C(=O)Nc1ccc(Cl)cn1
Show InChI InChI=1S/C25H18Cl2N4O2/c26-18-8-10-22(21(13-18)25(33)31-23-11-9-19(27)14-29-23)30-24(32)16-6-4-15(5-7-16)17-2-1-3-20(28)12-17/h1-14H,28H2,(H,30,32)(H,29,31,33)
Reactome pathway
n/an/a 1.90n/an/an/an/an/an/a
Millennium Pharmaceuticals, Inc.
Curated by ChEMBL
Assay Description
Inhibitory concentration against coagulation factor Xa.
Bioorg Med Chem Lett 14: 983-7 (2004)
Article DOI: 10.1016/j.bmcl.2003.11.079
BindingDB Entry DOI: 10.7270/Q21V5DF7