BDBM50142131 2'-Sulfamoyl-biphenyl-4-carboxylic acid [5-amino-2-(5-bromo-pyridin-2-ylcarbamoyl)-phenyl]-amide::CHEMBL177206
SMILES: Nc1ccc(C(=O)Nc2ccc(Br)cn2)c(NC(=O)c2ccc(cc2)-c2ccccc2S(N)(=O)=O)c1
InChI Key: InChIKey=PBIBDSDWIMZYDT-UHFFFAOYSA-N
Data: 1 IC50
Activity Spreadsheet -- Enzyme Inhibition Constant Data from BindingDB
Found 1 hit for monomerid = 50142131
Trg + Lig
Ki
nM
ΔG°
kcal/mole
IC50
nM
Kd
nM
EC50/IC50
nM
koff
s-1
kon
M-1s-1
pHTemp
°C
Coagulation factor X
(Homo sapiens (Human))
BDBM50142131
(2'-Sulfamoyl-biphenyl-4-carboxylic acid [5-amino-2...)
Show SMILES Nc1ccc(C(=O)Nc2ccc(Br)cn2)c(NC(=O)c2ccc(cc2)-c2ccccc2S(N)(=O)=O)c1
Show InChI InChI=1S/C25H20BrN5O4S/c26-17-9-12-23(29-14-17)31-25(33)20-11-10-18(27)13-21(20)30-24(32)16-7-5-15(6-8-16)19-3-1-2-4-22(19)36(28,34)35/h1-14H,27H2,(H,30,32)(H2,28,34,35)(H,29,31,33)
Reactome pathway
n/an/a 6.20n/an/an/an/an/an/a
Millennium Pharmaceuticals, Inc.
Curated by ChEMBL
Assay Description
Inhibitory concentration against coagulation factor Xa.
Bioorg Med Chem Lett 14: 983-7 (2004)
Article DOI: 10.1016/j.bmcl.2003.11.079
BindingDB Entry DOI: 10.7270/Q21V5DF7