BDBM50142176 5-Chloro-N-(5-chloro-pyridin-2-yl)-2-(4-{[methyl-(2-methylamino-ethyl)-amino]-methyl}-benzoylamino)-benzamide::CHEMBL175014
SMILES: CNCCN(C)Cc1ccc(cc1)C(=O)Nc1ccc(Cl)cc1C(=O)Nc1ccc(Cl)cn1
InChI Key: InChIKey=HVZQBAZMFIUZBO-UHFFFAOYSA-N
Data: 6 IC50
Activity Spreadsheet -- Enzyme Inhibition Constant Data from BindingDB
Found 6 hits for monomerid = 50142176
Trg + Lig
Ki
nM
ΔG°
kcal/mole
IC50
nM
Kd
nM
EC50/IC50
nM
koff
s-1
kon
M-1s-1
pHTemp
°C
Prothrombin
(Homo sapiens (Human))
BDBM50142176
(5-Chloro-N-(5-chloro-pyridin-2-yl)-2-(4-{[methyl-(...)
Show SMILES CNCCN(C)Cc1ccc(cc1)C(=O)Nc1ccc(Cl)cc1C(=O)Nc1ccc(Cl)cn1
Show InChI InChI=1S/C24H25Cl2N5O2/c1-27-11-12-31(2)15-16-3-5-17(6-4-16)23(32)29-21-9-7-18(25)13-20(21)24(33)30-22-10-8-19(26)14-28-22/h3-10,13-14,27H,11-12,15H2,1-2H3,(H,29,32)(H,28,30,33)
n/an/a>1.10E+4n/an/an/an/an/an/a
Millennium Pharmaceuticals, Inc.
Curated by ChEMBL
Assay Description
Inhibitory activity against thrombin.
Bioorg Med Chem Lett 14: 989-93 (2004)
Article DOI: 10.1016/j.bmcl.2003.11.080
BindingDB Entry DOI: 10.7270/Q2X34WXD
Trypsin-1
(Homo sapiens (Human))
BDBM50142176
(5-Chloro-N-(5-chloro-pyridin-2-yl)-2-(4-{[methyl-(...)
Show SMILES CNCCN(C)Cc1ccc(cc1)C(=O)Nc1ccc(Cl)cc1C(=O)Nc1ccc(Cl)cn1
Show InChI InChI=1S/C24H25Cl2N5O2/c1-27-11-12-31(2)15-16-3-5-17(6-4-16)23(32)29-21-9-7-18(25)13-20(21)24(33)30-22-10-8-19(26)14-28-22/h3-10,13-14,27H,11-12,15H2,1-2H3,(H,29,32)(H,28,30,33)
Reactome pathway
n/an/a>1.10E+4n/an/an/an/an/an/a
Millennium Pharmaceuticals, Inc.
Curated by ChEMBL
Assay Description
Inhibitory activity against trypsin.
Bioorg Med Chem Lett 14: 989-93 (2004)
Article DOI: 10.1016/j.bmcl.2003.11.080
BindingDB Entry DOI: 10.7270/Q2X34WXD
Vitamin K-dependent protein C
(Homo sapiens (Human))
BDBM50142176
(5-Chloro-N-(5-chloro-pyridin-2-yl)-2-(4-{[methyl-(...)
Show SMILES CNCCN(C)Cc1ccc(cc1)C(=O)Nc1ccc(Cl)cc1C(=O)Nc1ccc(Cl)cn1
Show InChI InChI=1S/C24H25Cl2N5O2/c1-27-11-12-31(2)15-16-3-5-17(6-4-16)23(32)29-21-9-7-18(25)13-20(21)24(33)30-22-10-8-19(26)14-28-22/h3-10,13-14,27H,11-12,15H2,1-2H3,(H,29,32)(H,28,30,33)
Reactome pathway
n/an/a>1.10E+4n/an/an/an/an/an/a
Millennium Pharmaceuticals, Inc.
Curated by ChEMBL
Assay Description
Inhibitory activity against activated protein C
Bioorg Med Chem Lett 14: 989-93 (2004)
Article DOI: 10.1016/j.bmcl.2003.11.080
BindingDB Entry DOI: 10.7270/Q2X34WXD
Coagulation factor X
(Homo sapiens (Human))
BDBM50142176
(5-Chloro-N-(5-chloro-pyridin-2-yl)-2-(4-{[methyl-(...)
Show SMILES CNCCN(C)Cc1ccc(cc1)C(=O)Nc1ccc(Cl)cc1C(=O)Nc1ccc(Cl)cn1
Show InChI InChI=1S/C24H25Cl2N5O2/c1-27-11-12-31(2)15-16-3-5-17(6-4-16)23(32)29-21-9-7-18(25)13-20(21)24(33)30-22-10-8-19(26)14-28-22/h3-10,13-14,27H,11-12,15H2,1-2H3,(H,29,32)(H,28,30,33)
Reactome pathway
n/an/a 6.80n/an/an/an/an/an/a
Millennium Pharmaceuticals, Inc.
Curated by ChEMBL
Assay Description
In vitro inhibitory activity against coagulation factor X.
Bioorg Med Chem Lett 14: 989-93 (2004)
Article DOI: 10.1016/j.bmcl.2003.11.080
BindingDB Entry DOI: 10.7270/Q2X34WXD
Tissue-type plasminogen activator
(Homo sapiens (Human))
BDBM50142176
(5-Chloro-N-(5-chloro-pyridin-2-yl)-2-(4-{[methyl-(...)
Show SMILES CNCCN(C)Cc1ccc(cc1)C(=O)Nc1ccc(Cl)cc1C(=O)Nc1ccc(Cl)cn1
Show InChI InChI=1S/C24H25Cl2N5O2/c1-27-11-12-31(2)15-16-3-5-17(6-4-16)23(32)29-21-9-7-18(25)13-20(21)24(33)30-22-10-8-19(26)14-28-22/h3-10,13-14,27H,11-12,15H2,1-2H3,(H,29,32)(H,28,30,33)
NCI pathway
Reactome pathway
n/an/a>1.10E+4n/an/an/an/an/an/a
Millennium Pharmaceuticals, Inc.
Curated by ChEMBL
Assay Description
Inhibitory activity against tissue type plasminogen activator.
Bioorg Med Chem Lett 14: 989-93 (2004)
Article DOI: 10.1016/j.bmcl.2003.11.080
BindingDB Entry DOI: 10.7270/Q2X34WXD
Plasminogen
(Homo sapiens (Human))
BDBM50142176
(5-Chloro-N-(5-chloro-pyridin-2-yl)-2-(4-{[methyl-(...)
Show SMILES CNCCN(C)Cc1ccc(cc1)C(=O)Nc1ccc(Cl)cc1C(=O)Nc1ccc(Cl)cn1
Show InChI InChI=1S/C24H25Cl2N5O2/c1-27-11-12-31(2)15-16-3-5-17(6-4-16)23(32)29-21-9-7-18(25)13-20(21)24(33)30-22-10-8-19(26)14-28-22/h3-10,13-14,27H,11-12,15H2,1-2H3,(H,29,32)(H,28,30,33)
NCI pathway
Reactome pathway
n/an/a>1.10E+4n/an/an/an/an/an/a
Millennium Pharmaceuticals, Inc.
Curated by ChEMBL
Assay Description
Inhibitory activity against plasmin.
Bioorg Med Chem Lett 14: 989-93 (2004)
Article DOI: 10.1016/j.bmcl.2003.11.080
BindingDB Entry DOI: 10.7270/Q2X34WXD