BDBM50142274 4-(3,4-Dichloro-benzenesulfonyl)-1-(5-methyl-3H-imidazol-4-ylmethyl)-2-phenethyl-2,3,4,5-tetrahydro-1H-benzo[e][1,4]diazepine::CHEMBL8414
SMILES: Cc1nc[nH]c1CN1C(CCc2ccccc2)CN(Cc2ccccc12)S(=O)(=O)c1ccc(Cl)c(Cl)c1
InChI Key: InChIKey=ATCZOHKTHRESBW-UHFFFAOYSA-N
Data: 3 IC50
Activity Spreadsheet -- Enzyme Inhibition Constant Data from BindingDB
Found 3 hits for monomerid = 50142274
Trg + Lig
Ki
nM
ΔG°
kcal/mole
IC50
nM
Kd
nM
EC50/IC50
nM
koff
s-1
kon
M-1s-1
pHTemp
°C
Cytochrome P450 2C9
(Homo sapiens (Human))
BDBM50142274
(4-(3,4-Dichloro-benzenesulfonyl)-1-(5-methyl-3H-im...)
Show SMILES Cc1nc[nH]c1CN1C(CCc2ccccc2)CN(Cc2ccccc12)S(=O)(=O)c1ccc(Cl)c(Cl)c1
Show InChI InChI=1S/C28H28Cl2N4O2S/c1-20-27(32-19-31-20)18-34-23(12-11-21-7-3-2-4-8-21)17-33(16-22-9-5-6-10-28(22)34)37(35,36)24-13-14-25(29)26(30)15-24/h2-10,13-15,19,23H,11-12,16-18H2,1H3,(H,31,32)
Reactome pathway
n/an/a 2.00E+3n/an/an/an/an/an/a
Pharmaceutical Research Institute
Curated by ChEMBL
Assay Description
Inhibitory activity of the compound against cytochrome P450 2C9
Bioorg Med Chem Lett 14: 1031-4 (2004)
Article DOI: 10.1016/j.bmcl.2003.11.052
BindingDB Entry DOI: 10.7270/Q2D50MCF
Mitochondrial complex V; ATP synthase
(Bos taurus)
BDBM50142274
(4-(3,4-Dichloro-benzenesulfonyl)-1-(5-methyl-3H-im...)
Show SMILES Cc1nc[nH]c1CN1C(CCc2ccccc2)CN(Cc2ccccc12)S(=O)(=O)c1ccc(Cl)c(Cl)c1
Show InChI InChI=1S/C28H28Cl2N4O2S/c1-20-27(32-19-31-20)18-34-23(12-11-21-7-3-2-4-8-21)17-33(16-22-9-5-6-10-28(22)34)37(35,36)24-13-14-25(29)26(30)15-24/h2-10,13-15,19,23H,11-12,16-18H2,1H3,(H,31,32)
n/an/a 22n/an/an/an/an/an/a
Pharmaceutical Research Institute
Curated by ChEMBL
Assay Description
Inhibitory activity against bovine mitochondrial F1F0-ATP hydrolase
Bioorg Med Chem Lett 14: 1031-4 (2004)
Article DOI: 10.1016/j.bmcl.2003.11.052
BindingDB Entry DOI: 10.7270/Q2D50MCF
Mitochondrial complex V; ATP synthase
(Bos taurus)
BDBM50142274
(4-(3,4-Dichloro-benzenesulfonyl)-1-(5-methyl-3H-im...)
Show SMILES Cc1nc[nH]c1CN1C(CCc2ccccc2)CN(Cc2ccccc12)S(=O)(=O)c1ccc(Cl)c(Cl)c1
Show InChI InChI=1S/C28H28Cl2N4O2S/c1-20-27(32-19-31-20)18-34-23(12-11-21-7-3-2-4-8-21)17-33(16-22-9-5-6-10-28(22)34)37(35,36)24-13-14-25(29)26(30)15-24/h2-10,13-15,19,23H,11-12,16-18H2,1H3,(H,31,32)
n/an/a>3.00E+4n/an/an/an/an/an/a
Pharmaceutical Research Institute
Curated by ChEMBL
Assay Description
Inhibitory activity against bovine mitochondrial F1F0-ATP synthase
Bioorg Med Chem Lett 14: 1031-4 (2004)
Article DOI: 10.1016/j.bmcl.2003.11.052
BindingDB Entry DOI: 10.7270/Q2D50MCF