BDBM50142370 2-{(2R,5R)-2-(2,4-Dichloro-phenyl)-5-[((R)-1-naphthalen-1-yl-ethylcarbamoyl)-methyl]-4-oxo-thiazolidin-3-yl}-N-(3-piperidin-1-yl-propyl)-acetamide::CHEMBL42334
SMILES: C[C@@H](NC(=O)C[C@H]1S[C@@H](N(CC(=O)NCCCN2CCCCC2)C1=O)c1ccc(Cl)cc1Cl)c1cccc2ccccc12
InChI Key: InChIKey=COUJFDKQCHWQLT-PCLMVKJGSA-N
Data: 1 IC50  1 EC50
Activity Spreadsheet -- Enzyme Inhibition Constant Data from BindingDB
Found 2 hits for monomerid = 50142370
Trg + Lig
Ki
nM
ΔG°
kcal/mole
IC50
nM
Kd
nM
EC50/IC50
nM
koff
s-1
kon
M-1s-1
pHTemp
°C
C-C chemokine receptor type 4
(Homo sapiens (Human))
BDBM50142370
(2-{(2R,5R)-2-(2,4-Dichloro-phenyl)-5-[((R)-1-napht...)
Show SMILES C[C@@H](NC(=O)C[C@H]1S[C@@H](N(CC(=O)NCCCN2CCCCC2)C1=O)c1ccc(Cl)cc1Cl)c1cccc2ccccc12
Show InChI InChI=1S/C33H38Cl2N4O3S/c1-22(25-12-7-10-23-9-3-4-11-26(23)25)37-30(40)20-29-32(42)39(33(43-29)27-14-13-24(34)19-28(27)35)21-31(41)36-15-8-18-38-16-5-2-6-17-38/h3-4,7,9-14,19,22,29,33H,2,5-6,8,15-18,20-21H2,1H3,(H,36,41)(H,37,40)/t22-,29-,33-/m1/s1
n/an/a 110n/an/an/an/an/an/a
Array BioPharma
Curated by ChEMBL
Assay Description
Inhibition of [125I]-MDC binding to recombinant human C-C chemokine receptor type 4 (CCR4) expressed in murine pre-B cells
Bioorg Med Chem Lett 14: 1619-24 (2004)
Article DOI: 10.1016/j.bmcl.2004.01.072
BindingDB Entry DOI: 10.7270/Q2W37VRK
C-C chemokine receptor type 4 (CCR4)
(Homo sapiens (Human))
BDBM50142370
(2-{(2R,5R)-2-(2,4-Dichloro-phenyl)-5-[((R)-1-napht...)
Show SMILES C[C@@H](NC(=O)C[C@H]1S[C@@H](N(CC(=O)NCCCN2CCCCC2)C1=O)c1ccc(Cl)cc1Cl)c1cccc2ccccc12
Show InChI InChI=1S/C33H38Cl2N4O3S/c1-22(25-12-7-10-23-9-3-4-11-26(23)25)37-30(40)20-29-32(42)39(33(43-29)27-14-13-24(34)19-28(27)35)21-31(41)36-15-8-18-38-16-5-2-6-17-38/h3-4,7,9-14,19,22,29,33H,2,5-6,8,15-18,20-21H2,1H3,(H,36,41)(H,37,40)/t22-,29-,33-/m1/s1
n/an/an/an/a 600n/an/an/an/a
Array BioPharma
Curated by ChEMBL
Assay Description
Inhibition of MDC-stimulated chemotaxis in transfected murine cell line expressing human chemokine receptor 4
Bioorg Med Chem Lett 14: 1619-24 (2004)
Article DOI: 10.1016/j.bmcl.2004.01.072
BindingDB Entry DOI: 10.7270/Q2W37VRK