BDBM50142840 (R)-2-[(R)-(3,4-Dichloro-phenyl)-methoxycarbonyl-methyl]-piperidinium; chloride::(R)-methyl 2-(3,4-dichlorophenyl)-2-((R)-piperidin-2-yl)acetate hydrochloride::CHEMBL54134
SMILES: COC(=O)[C@@H]([C@H]1CCCC[NH2+]1)c1ccc(Cl)c(Cl)c1
InChI Key: InChIKey=JUKMAYKVHWKRKY-CHWSQXEVSA-O
Data: 2 KI  1 IC50
Activity Spreadsheet -- Enzyme Inhibition Constant Data from BindingDB
Found 3 hits for monomerid = 50142840
Trg + Lig
Ki
nM
ΔG°
kcal/mole
IC50
nM
Kd
nM
EC50/IC50
nM
koff
s-1
kon
M-1s-1
pHTemp
°C
Sodium-dependent dopamine transporter
(Rattus norvegicus (rat))
BDBM50142840
((R)-2-[(R)-(3,4-Dichloro-phenyl)-methoxycarbonyl-m...)
Show SMILES COC(=O)[C@@H]([C@H]1CCCC[NH2+]1)c1ccc(Cl)c(Cl)c1
Show InChI InChI=1S/C14H17Cl2NO2/c1-19-14(18)13(12-4-2-3-7-17-12)9-5-6-10(15)11(16)8-9/h5-6,8,12-13,17H,2-4,7H2,1H3/p+1/t12-,13-/m1/s1
Reactome pathway
4.80n/an/an/an/an/an/an/an/a
School of Chemistry and Biochemistry
Curated by ChEMBL
Assay Description
Displacement of [3H]WIN-35428 from DAT in Sprague-Dawley rat striatum
J Med Chem 50: 2718-31 (2007)
Article DOI: 10.1021/jm061354p
BindingDB Entry DOI: 10.7270/Q2Q81DXB
Sodium-dependent serotonin transporter
(Rattus norvegicus (rat))
BDBM50142840
((R)-2-[(R)-(3,4-Dichloro-phenyl)-methoxycarbonyl-m...)
Show SMILES COC(=O)[C@@H]([C@H]1CCCC[NH2+]1)c1ccc(Cl)c(Cl)c1
Show InChI InChI=1S/C14H17Cl2NO2/c1-19-14(18)13(12-4-2-3-7-17-12)9-5-6-10(15)11(16)8-9/h5-6,8,12-13,17H,2-4,7H2,1H3/p+1/t12-,13-/m1/s1
667n/an/an/an/an/an/an/an/a
School of Chemistry and Biochemistry
Curated by ChEMBL
Assay Description
Displacement of [3H]citalopram from 5HTT in Sprague-Dawley rat cerebrum
J Med Chem 50: 2718-31 (2007)
Article DOI: 10.1021/jm061354p
BindingDB Entry DOI: 10.7270/Q2Q81DXB
Sodium-dependent dopamine transporter
(Rattus norvegicus (rat))
BDBM50142840
((R)-2-[(R)-(3,4-Dichloro-phenyl)-methoxycarbonyl-m...)
Show SMILES COC(=O)[C@@H]([C@H]1CCCC[NH2+]1)c1ccc(Cl)c(Cl)c1
Show InChI InChI=1S/C14H17Cl2NO2/c1-19-14(18)13(12-4-2-3-7-17-12)9-5-6-10(15)11(16)8-9/h5-6,8,12-13,17H,2-4,7H2,1H3/p+1/t12-,13-/m1/s1
Reactome pathway
n/an/a 7n/an/an/an/an/an/a
School of Chemistry and Biochemistry
Curated by ChEMBL
Assay Description
Inhibition of [3H]DA uptake at DAT in Sprague-Dawley rat striatum
J Med Chem 50: 2718-31 (2007)
Article DOI: 10.1021/jm061354p
BindingDB Entry DOI: 10.7270/Q2Q81DXB