BDBM50143194 CHEMBL3758346
SMILES: CC(C)CC1(O)CCN(CC1)C(=O)Nc1cc(Oc2ccc(cc2)C(O)=O)cc(Oc2ccc(F)c(F)c2)c1
InChI Key: InChIKey=OPXCZLVWSZDHEE-UHFFFAOYSA-N
Data: 1 IC50
Activity Spreadsheet -- Enzyme Inhibition Constant Data from BindingDB
Found 1 hit for monomerid = 50143194
Trg + Lig
Ki
nM
ΔG°
kcal/mole
IC50
nM
Kd
nM
EC50/IC50
nM
koff
s-1
kon
M-1s-1
pHTemp
°C
Sphingosine 1-phosphate receptor 2
(Homo sapiens (Human))
BDBM50143194
(CHEMBL3758346)
Show SMILES CC(C)CC1(O)CCN(CC1)C(=O)Nc1cc(Oc2ccc(cc2)C(O)=O)cc(Oc2ccc(F)c(F)c2)c1
Show InChI InChI=1S/C29H30F2N2O6/c1-18(2)17-29(37)9-11-33(12-10-29)28(36)32-20-13-23(38-21-5-3-19(4-6-21)27(34)35)15-24(14-20)39-22-7-8-25(30)26(31)16-22/h3-8,13-16,18,37H,9-12,17H2,1-2H3,(H,32,36)(H,34,35)
NCI pathway
Reactome pathway
n/an/a 25n/an/an/an/an/an/a
Ono Pharmaceutical Co.
Curated by ChEMBL
Assay Description
Antagonist activity at S1P2 receptor (unknown origin) expressed in CHO cells assessed as inhibition of S1P-induced increase in intracellular calcium ...
Bioorg Med Chem Lett 26: 1209-13 (2016)
BindingDB Entry DOI: 10.7270/Q2ST7RQ6