BDBM50143207 CHEMBL308819
SMILES: O=c1ccc2ccc(OCC#C)cc2o1
InChI Key: InChIKey=IEHFVZKMAOKFTR-UHFFFAOYSA-N
Data: 5 KI  1 IC50
Activity Spreadsheet -- Enzyme Inhibition Constant Data from BindingDB
Found 6 hits for monomerid = 50143207
Trg + Lig
Ki
nM
ΔG°
kcal/mole
IC50
nM
Kd
nM
EC50/IC50
nM
koff
s-1
kon
M-1s-1
pHTemp
°C
Carbonic anhydrase
(Homo sapiens (Human))
BDBM50143207
(CHEMBL308819)
Show SMILES O=c1ccc2ccc(OCC#C)cc2o1
Show InChI InChI=1S/C12H8O3/c1-2-7-14-10-5-3-9-4-6-12(13)15-11(9)8-10/h1,3-6,8H,7H2
Reactome pathway
76n/an/an/an/an/an/an/an/a
Universit£ degli Studi di Firenze
Curated by ChEMBL
Assay Description
Inhibition of recombinant human carbonic anhydrase 4 incubated for 6 hrs prior to testing measured for 10 to 100 secs by phenol red-based stopped-flo...
J Med Chem 62: 7233-7249 (2019)
Article DOI: 10.1021/acs.jmedchem.9b00845
Carbonic anhydrase 12
(Homo sapiens (Human))
BDBM50143207
(CHEMBL308819)
Show SMILES O=c1ccc2ccc(OCC#C)cc2o1
Show InChI InChI=1S/C12H8O3/c1-2-7-14-10-5-3-9-4-6-12(13)15-11(9)8-10/h1,3-6,8H,7H2
Reactome pathway
730n/an/an/an/an/an/an/an/a
Universit£ degli Studi di Firenze
Curated by ChEMBL
Assay Description
Inhibition of human carbonic anhydrase 12 catalytic domain by Stopped-Flow CO2 Hydrase assay
J Med Chem 59: 462-73 (2016)
BindingDB Entry DOI: 10.7270/Q2P2710K
Carbonic anhydrase 9
(Homo sapiens (Human))
BDBM50143207
(CHEMBL308819)
Show SMILES O=c1ccc2ccc(OCC#C)cc2o1
Show InChI InChI=1S/C12H8O3/c1-2-7-14-10-5-3-9-4-6-12(13)15-11(9)8-10/h1,3-6,8H,7H2
NCI pathway
Reactome pathway
1.35E+3n/an/an/an/an/an/an/an/a
Universit£ degli Studi di Firenze
Curated by ChEMBL
Assay Description
Inhibition of human carbonic anhydrase 9 catalytic domain by Stopped-Flow CO2 Hydrase assay
J Med Chem 59: 462-73 (2016)
BindingDB Entry DOI: 10.7270/Q2P2710K
Carbonic anhydrase 1
(Homo sapiens (Human))
BDBM50143207
(CHEMBL308819)
Show SMILES O=c1ccc2ccc(OCC#C)cc2o1
Show InChI InChI=1S/C12H8O3/c1-2-7-14-10-5-3-9-4-6-12(13)15-11(9)8-10/h1,3-6,8H,7H2
NCI pathway
Reactome pathway
7.20E+4n/an/an/an/an/an/an/an/a
Universit£ degli Studi di Firenze
Curated by ChEMBL
Assay Description
Inhibition of human carbonic anhydrase 1 by Stopped-Flow CO2 Hydrase assay
J Med Chem 59: 462-73 (2016)
BindingDB Entry DOI: 10.7270/Q2P2710K
Carbonic anhydrase 2
(Homo sapiens (Human))
BDBM50143207
(CHEMBL308819)
Show SMILES O=c1ccc2ccc(OCC#C)cc2o1
Show InChI InChI=1S/C12H8O3/c1-2-7-14-10-5-3-9-4-6-12(13)15-11(9)8-10/h1,3-6,8H,7H2
Reactome pathway
>1.00E+5n/an/an/an/an/an/an/an/a
Universit£ degli Studi di Firenze
Curated by ChEMBL
Assay Description
Inhibition of human carbonic anhydrase 2 by Stopped-Flow CO2 Hydrase assay
J Med Chem 59: 462-73 (2016)
BindingDB Entry DOI: 10.7270/Q2P2710K
Steroid 5-alpha-reductase
(Homo sapiens (Human))
BDBM50143207
(CHEMBL308819)
Show SMILES O=c1ccc2ccc(OCC#C)cc2o1
Show InChI InChI=1S/C12H8O3/c1-2-7-14-10-5-3-9-4-6-12(13)15-11(9)8-10/h1,3-6,8H,7H2
n/an/a>20n/an/an/an/an/an/a
Seoul National University
Curated by ChEMBL
Assay Description
Inhibitory activity against 5-alpha-reductase type 1 in cell culture system using LNCaP cells (androgen-sensitive human prostatic cancer cell line)
Bioorg Med Chem Lett 11: 2361-3 (2001)
BindingDB Entry DOI: 10.7270/Q2RR1ZS9