BDBM50143258 CHEMBL3759100
SMILES: Cn1cc(cn1)-c1cnc(Nc2cccc(Cn3nc(ccc3=O)-c3cccc(c3)C#N)c2)nc1
InChI Key: InChIKey=DKQXJYSYPIMUQW-UHFFFAOYSA-N
Data: 1 IC50
Activity Spreadsheet -- Enzyme Inhibition Constant Data from BindingDB
Found 1 hit for monomerid = 50143258
Trg + Lig
Ki
nM
ΔG°
kcal/mole
IC50
nM
Kd
nM
EC50/IC50
nM
koff
s-1
kon
M-1s-1
pHTemp
°C
Hepatocyte growth factor receptor
(Homo sapiens (Human))
BDBM50143258
(CHEMBL3759100)
Show SMILES Cn1cc(cn1)-c1cnc(Nc2cccc(Cn3nc(ccc3=O)-c3cccc(c3)C#N)c2)nc1
Show InChI InChI=1S/C26H20N8O/c1-33-17-22(15-30-33)21-13-28-26(29-14-21)31-23-7-3-5-19(11-23)16-34-25(35)9-8-24(32-34)20-6-2-4-18(10-20)12-27/h2-11,13-15,17H,16H2,1H3,(H,28,29,31)
n/an/a 5.60n/an/an/an/an/an/a
Chinese Academy of Sciences
Curated by ChEMBL
Assay Description
Inhibition of recombinant c-Met (unknown origin) using poly (Glu,Tyr)4:1 as substrate after 60 mins by ELISA
Eur J Med Chem 108: 322-33 (2016)
BindingDB Entry DOI: 10.7270/Q2DJ5HG7