BDBM50143307 1-Pentadecyl-pyridinium; bromide::CHEMBL55479
SMILES: CCCCCCCCCCCCCCC[n+]1ccccc1
InChI Key: InChIKey=JCZHPUQUBJFDFN-UHFFFAOYSA-N
Data: 1 KI  1 IC50
Activity Spreadsheet -- Enzyme Inhibition Constant Data from BindingDB
Found 2 hits for monomerid = 50143307
Trg + Lig
Ki
nM
ΔG°
kcal/mole
IC50
nM
Kd
nM
EC50/IC50
nM
koff
s-1
kon
M-1s-1
pHTemp
°C
Neuronal acetylcholine receptor protein alpha-4/beta-2 subunit
(Rattus norvegicus (Rat))
BDBM50143307
(1-Pentadecyl-pyridinium; bromide | CHEMBL55479)
Show SMILES CCCCCCCCCCCCCCC[n+]1ccccc1
Show InChI InChI=1S/C20H36N/c1-2-3-4-5-6-7-8-9-10-11-12-13-15-18-21-19-16-14-17-20-21/h14,16-17,19-20H,2-13,15,18H2,1H3/q+1
3.80E+4n/an/an/an/an/an/an/an/a
University of Kentucky
Curated by ChEMBL
Assay Description
Inhibition of [3H]-nicotine binding to Nicotinic acetylcholine receptor alpha4-beta2 in rat brain
Bioorg Med Chem Lett 14: 1869-74 (2004)
Article DOI: 10.1016/j.bmcl.2003.10.074
BindingDB Entry DOI: 10.7270/Q21N80JP
Neuronal acetylcholine receptor protein alpha-4/beta-2 subunit
(Rattus norvegicus (Rat))
BDBM50143307
(1-Pentadecyl-pyridinium; bromide | CHEMBL55479)
Show SMILES CCCCCCCCCCCCCCC[n+]1ccccc1
Show InChI InChI=1S/C20H36N/c1-2-3-4-5-6-7-8-9-10-11-12-13-15-18-21-19-16-14-17-20-21/h14,16-17,19-20H,2-13,15,18H2,1H3/q+1
n/an/a 320n/an/an/an/an/an/a
University of Kentucky
Curated by ChEMBL
Assay Description
Inhibitory activity of the compound against nAChR mediated nicotine-evoked [3H]-DA overflow using rat striatal slices
Bioorg Med Chem Lett 14: 1869-74 (2004)
Article DOI: 10.1016/j.bmcl.2003.10.074
BindingDB Entry DOI: 10.7270/Q21N80JP