BDBM50143309 1-Decyl-pyridinium; iodide::CHEMBL55297
SMILES: CCCCCCCCCC[n+]1ccccc1
InChI Key: InChIKey=MFMBELVKZWEQOM-UHFFFAOYSA-N
Data: 1 KI  1 IC50
Activity Spreadsheet -- Enzyme Inhibition Constant Data from BindingDB
Found 2 hits for monomerid = 50143309
Trg + Lig
Ki
nM
ΔG°
kcal/mole
IC50
nM
Kd
nM
EC50/IC50
nM
koff
s-1
kon
M-1s-1
pHTemp
°C
Neuronal acetylcholine receptor protein alpha-4/beta-2 subunit
(Rattus norvegicus (Rat))
BDBM50143309
(1-Decyl-pyridinium; iodide | CHEMBL55297)
Show SMILES CCCCCCCCCC[n+]1ccccc1
Show InChI InChI=1S/C15H26N/c1-2-3-4-5-6-7-8-10-13-16-14-11-9-12-15-16/h9,11-12,14-15H,2-8,10,13H2,1H3/q+1
1.70E+4n/an/an/an/an/an/an/an/a
University of Kentucky
Curated by ChEMBL
Assay Description
Inhibitory activity of the compound against nAChR mediated nicotine-evoked [3H]-DA overflow using rat striatal slices
Bioorg Med Chem Lett 14: 1869-74 (2004)
Article DOI: 10.1016/j.bmcl.2003.10.074
BindingDB Entry DOI: 10.7270/Q21N80JP
Neuronal acetylcholine receptor protein alpha-4/beta-2 subunit
(Rattus norvegicus (Rat))
BDBM50143309
(1-Decyl-pyridinium; iodide | CHEMBL55297)
Show SMILES CCCCCCCCCC[n+]1ccccc1
Show InChI InChI=1S/C15H26N/c1-2-3-4-5-6-7-8-10-13-16-14-11-9-12-15-16/h9,11-12,14-15H,2-8,10,13H2,1H3/q+1
n/an/a 130n/an/an/an/an/an/a
University of Kentucky
Curated by ChEMBL
Assay Description
Inhibition of [3H]-nicotine binding to Nicotinic acetylcholine receptor alpha4-beta2 in rat brain
Bioorg Med Chem Lett 14: 1869-74 (2004)
Article DOI: 10.1016/j.bmcl.2003.10.074
BindingDB Entry DOI: 10.7270/Q21N80JP