BDBM50143357 (S)-N*4*-Acridin-9-yl-N*1*,N*1*-diethyl-pentane-1,4-diamine::CHEMBL56397
SMILES: CCN(CC)CCC[C@H](C)Nc1c2ccccc2nc2ccccc12
InChI Key: InChIKey=QRPXUGKLXFUGCX-KRWDZBQOSA-N
Data: 1 IC50
Activity Spreadsheet -- Enzyme Inhibition Constant Data from BindingDB
Found 1 hit for monomerid = 50143357
Trg + Lig
Ki
nM
ΔG°
kcal/mole
IC50
nM
Kd
nM
EC50/IC50
nM
koff
s-1
kon
M-1s-1
pHTemp
°C
Voltage-dependent calcium channel subunit alpha-2/delta-1
(Homo sapiens (Human))
BDBM50143357
((S)-N*4*-Acridin-9-yl-N*1*,N*1*-diethyl-pentane-1,...)
Show SMILES CCN(CC)CCC[C@H](C)Nc1c2ccccc2nc2ccccc12
Show InChI InChI=1S/C22H29N3/c1-4-25(5-2)16-10-11-17(3)23-22-18-12-6-8-14-20(18)24-21-15-9-7-13-19(21)22/h6-9,12-15,17H,4-5,10-11,16H2,1-3H3,(H,23,24)/t17-/m0/s1
n/an/a 110n/an/an/an/an/an/a
Merck Research Laboratories
Curated by ChEMBL
Assay Description
Binding affinity towards alpha2-delta subunit of a voltage gated calcium channel using [3H]-gabapentin in human brain membrane (A710 membrane)
Bioorg Med Chem Lett 14: 1913-6 (2004)
Article DOI: 10.1016/j.bmcl.2004.01.087
BindingDB Entry DOI: 10.7270/Q2HQ3ZBQ