BDBM50143527 (1R,2S)-2-Hexadecyl-5-oxo-cyclopent-3-enecarboxylic acid methyl ester::CHEMBL177693
SMILES: CCCCCCCCCCCCCCCC[C@H]1C=CC(=O)[C@@H]1C(=O)OC
InChI Key: InChIKey=FIXDKBASLLNUMM-RBBKRZOGSA-N
Data: 1 IC50
Activity Spreadsheet -- Enzyme Inhibition Constant Data from BindingDB
Found 1 hit for monomerid = 50143527
Trg + Lig
Ki
nM
ΔG°
kcal/mole
IC50
nM
Kd
nM
EC50/IC50
nM
koff
s-1
kon
M-1s-1
pHTemp
°C
Terminal deoxynucleotidyltransferase
(Homo sapiens (Human))
BDBM50143527
((1R,2S)-2-Hexadecyl-5-oxo-cyclopent-3-enecarboxyli...)
Show SMILES CCCCCCCCCCCCCCCC[C@H]1C=CC(=O)[C@@H]1C(=O)OC |c:17|
Show InChI InChI=1S/C23H40O3/c1-3-4-5-6-7-8-9-10-11-12-13-14-15-16-17-20-18-19-21(24)22(20)23(25)26-2/h18-20,22H,3-17H2,1-2H3/t20-,22+/m0/s1
NCI pathway
n/an/a 8.40E+4n/an/an/an/an/an/a
Tokyo University of Science
Curated by ChEMBL
Assay Description
Inhibitory activity of the compound against human terminal deoxynucleotidyltransferase
Bioorg Med Chem Lett 14: 1975-7 (2004)
Article DOI: 10.1016/j.bmcl.2004.01.092
BindingDB Entry DOI: 10.7270/Q2W095C3