null
SMILES: CCCCCCCCCCCCCCCC[C@]1(OCOC)C=CC(=O)[C@H]1C(=O)OC
InChI Key: InChIKey=WTRRAFSJIMDBKP-ZCYQVOJMSA-N
Activity Spreadsheet -- Enzyme Inhibition Constant Data from BindingDB
Found 1 hit for monomerid = 50143528
Trg + Lig
Ki
nM
ΔG°
kcal/mole
IC50
nM
Kd
nM
EC50/IC50
nM
koff
s-1
kon
M-1s-1
pHTemp
°C
DNA nucleotidylexotransferase
(Homo sapiens (Human))
BDBM50143528
((1S,2S)-2-Hexadecyl-2-methoxymethoxy-5-oxo-cyclope...)
Show SMILES CCCCCCCCCCCCCCCC[C@]1(OCOC)C=CC(=O)[C@H]1C(=O)OC |c:21|
Show InChI InChI=1S/C25H44O5/c1-4-5-6-7-8-9-10-11-12-13-14-15-16-17-19-25(30-21-28-2)20-18-22(26)23(25)24(27)29-3/h18,20,23H,4-17,19,21H2,1-3H3/t23-,25-/m0/s1
NCI pathway
n/an/a 1.80E+4n/an/an/an/an/an/a
Tokyo University of Science
Curated by ChEMBL
Assay Description
Inhibitory activity of the compound against human terminal deoxynucleotidyltransferase
Bioorg Med Chem Lett 14: 1975-7 (2004)
Article DOI: 10.1016/j.bmcl.2004.01.092
BindingDB Entry DOI: 10.7270/Q2W095C3