BDBM50143606 20-cyclobutylmethyl-(1R,12R)-7-thia-5,20-diazapentacyclo[10.5.3.01,13.02,10.04,8]icosa-2(10),3,5,8-tetraen-6-amine::CHEMBL56171
SMILES: Nc1nc2cc3c(C[C@@H]4C5CCCC[C@]35CCN4CC3CCC3)cc2s1
InChI Key: InChIKey=HEIQNYAVPBPIJD-RYLMWKJUSA-N
Data: 3 KI  2 EC50
Activity Spreadsheet -- Enzyme Inhibition Constant Data from BindingDB
Found 5 hits for monomerid = 50143606
Trg + Lig
Ki
nM
ΔG°
kcal/mole
IC50
nM
Kd
nM
EC50/IC50
nM
koff
s-1
kon
M-1s-1
pHTemp
°C
Kappa-type opioid receptor
(Homo sapiens (Human))
BDBM50143606
(20-cyclobutylmethyl-(1R,12R)-7-thia-5,20-diazapent...)
Show SMILES Nc1nc2cc3c(C[C@@H]4C5CCCC[C@]35CCN4CC3CCC3)cc2s1 |THB:10:9:5.6.7:17.15.16|
Show InChI InChI=1S/C22H29N3S/c23-21-24-18-12-17-15(11-20(18)26-21)10-19-16-6-1-2-7-22(16,17)8-9-25(19)13-14-4-3-5-14/h11-12,14,16,19H,1-10,13H2,(H2,23,24)/t16?,19-,22-/m1/s1
Reactome pathway
0.790n/an/an/an/an/an/an/an/a
Harvard Medical School
Curated by ChEMBL
Assay Description
Agonistic activity against kappa opioid receptor in Chinese hamster ovary membranes
J Med Chem 47: 1886-8 (2004)
Article DOI: 10.1021/jm049978n
BindingDB Entry DOI: 10.7270/Q2N58N4X
Mu-type opioid receptor
(Homo sapiens (Human))
BDBM50143606
(20-cyclobutylmethyl-(1R,12R)-7-thia-5,20-diazapent...)
Show SMILES Nc1nc2cc3c(C[C@@H]4C5CCCC[C@]35CCN4CC3CCC3)cc2s1 |THB:10:9:5.6.7:17.15.16|
Show InChI InChI=1S/C22H29N3S/c23-21-24-18-12-17-15(11-20(18)26-21)10-19-16-6-1-2-7-22(16,17)8-9-25(19)13-14-4-3-5-14/h11-12,14,16,19H,1-10,13H2,(H2,23,24)/t16?,19-,22-/m1/s1
NCI pathway
Reactome pathway
7.10n/an/an/an/an/an/an/an/a
Harvard Medical School
Curated by ChEMBL
Assay Description
Inhibition of [3H]-DAMGO binding to Opioid receptor mu 1 of Chinese hamster ovary membrane
J Med Chem 47: 1886-8 (2004)
Article DOI: 10.1021/jm049978n
BindingDB Entry DOI: 10.7270/Q2N58N4X
Delta-type opioid receptor
(Homo sapiens (Human))
BDBM50143606
(20-cyclobutylmethyl-(1R,12R)-7-thia-5,20-diazapent...)
Show SMILES Nc1nc2cc3c(C[C@@H]4C5CCCC[C@]35CCN4CC3CCC3)cc2s1 |THB:10:9:5.6.7:17.15.16|
Show InChI InChI=1S/C22H29N3S/c23-21-24-18-12-17-15(11-20(18)26-21)10-19-16-6-1-2-7-22(16,17)8-9-25(19)13-14-4-3-5-14/h11-12,14,16,19H,1-10,13H2,(H2,23,24)/t16?,19-,22-/m1/s1
Reactome pathway
230n/an/an/an/an/an/an/an/a
Harvard Medical School
Curated by ChEMBL
Assay Description
Inhibition of [3H]naltrindole binding to opioid receptor delta 1 of Chinese hamster ovary membrane
J Med Chem 47: 1886-8 (2004)
Article DOI: 10.1021/jm049978n
BindingDB Entry DOI: 10.7270/Q2N58N4X
Mu-type opioid receptor
(Homo sapiens (Human))
BDBM50143606
(20-cyclobutylmethyl-(1R,12R)-7-thia-5,20-diazapent...)
Show SMILES Nc1nc2cc3c(C[C@@H]4C5CCCC[C@]35CCN4CC3CCC3)cc2s1 |THB:10:9:5.6.7:17.15.16|
Show InChI InChI=1S/C22H29N3S/c23-21-24-18-12-17-15(11-20(18)26-21)10-19-16-6-1-2-7-22(16,17)8-9-25(19)13-14-4-3-5-14/h11-12,14,16,19H,1-10,13H2,(H2,23,24)/t16?,19-,22-/m1/s1
NCI pathway
Reactome pathway
n/an/an/an/a>1.00E+3n/an/an/an/a
Harvard Medical School
Curated by ChEMBL
Assay Description
Agonistic activity against Opioid receptor mu 1 in Chinese hamster ovary membranes
J Med Chem 47: 1886-8 (2004)
Article DOI: 10.1021/jm049978n
BindingDB Entry DOI: 10.7270/Q2N58N4X
Kappa-type opioid receptor
(Homo sapiens (Human))
BDBM50143606
(20-cyclobutylmethyl-(1R,12R)-7-thia-5,20-diazapent...)
Show SMILES Nc1nc2cc3c(C[C@@H]4C5CCCC[C@]35CCN4CC3CCC3)cc2s1 |THB:10:9:5.6.7:17.15.16|
Show InChI InChI=1S/C22H29N3S/c23-21-24-18-12-17-15(11-20(18)26-21)10-19-16-6-1-2-7-22(16,17)8-9-25(19)13-14-4-3-5-14/h11-12,14,16,19H,1-10,13H2,(H2,23,24)/t16?,19-,22-/m1/s1
Reactome pathway
n/an/an/an/a 29n/an/an/an/a
Harvard Medical School
Curated by ChEMBL
Assay Description
Agonistic activity against kappa opioid receptor in Chinese hamster ovary membranes
J Med Chem 47: 1886-8 (2004)
Article DOI: 10.1021/jm049978n
BindingDB Entry DOI: 10.7270/Q2N58N4X