null
SMILES: FC(F)(F)S(=O)(=O)Nc1ccc2c(\C=C\c3ccc4ccccc4n3)cccc2c1
InChI Key: InChIKey=ZZHRLTHFRKTIEE-CSKARUKUSA-N
Activity Spreadsheet -- Enzyme Inhibition Constant Data from BindingDB
Found 1 hit for monomerid = 50143615
Trg + Lig
Ki
nM
ΔG°
kcal/mole
IC50
nM
Kd
nM
EC50/IC50
nM
koff
s-1
kon
M-1s-1
pHTemp
°C
Capsid scaffolding protein
(Human cytomegalovirus (strain AD169) (HHV-5) (Huma...)
BDBM50143615
(C,C,C-Trifluoro-N-[5-(2-quinolin-2-yl-vinyl)-napht...)
Show SMILES FC(F)(F)S(=O)(=O)Nc1ccc2c(\C=C\c3ccc4ccccc4n3)cccc2c1
Show InChI InChI=1S/C22H15F3N2O2S/c23-22(24,25)30(28,29)27-19-12-13-20-15(5-3-6-17(20)14-19)8-10-18-11-9-16-4-1-2-7-21(16)26-18/h1-14,27H/b10-8+
n/an/a 9.5n/an/an/an/an/an/a
Wyeth Research
Curated by ChEMBL
Assay Description
Inhibitory concentration against HCMV protease.
J Med Chem 47: 1893-9 (2004)
Article DOI: 10.1021/jm030540h
BindingDB Entry DOI: 10.7270/Q2765DRK