null
SMILES: OC(=O)c1ccc(CNc2ccc3c(COc4ccccc4)cccc3c2)cc1
InChI Key: InChIKey=GXAKENZGOLSLFK-UHFFFAOYSA-N
Activity Spreadsheet -- Enzyme Inhibition Constant Data from BindingDB
Found 1 hit for monomerid = 50143616
Trg + Lig
Ki
nM
ΔG°
kcal/mole
IC50
nM
Kd
nM
EC50/IC50
nM
koff
s-1
kon
M-1s-1
pHTemp
°C
Capsid scaffolding protein
(Human cytomegalovirus (strain AD169) (HHV-5) (Huma...)
BDBM50143616
(4-[(5-Phenoxymethyl-naphthalen-2-ylamino)-methyl]-...)
Show SMILES OC(=O)c1ccc(CNc2ccc3c(COc4ccccc4)cccc3c2)cc1
Show InChI InChI=1S/C25H21NO3/c27-25(28)19-11-9-18(10-12-19)16-26-22-13-14-24-20(15-22)5-4-6-21(24)17-29-23-7-2-1-3-8-23/h1-15,26H,16-17H2,(H,27,28)
n/an/a 4.80n/an/an/an/an/an/a
Wyeth Research
Curated by ChEMBL
Assay Description
Inhibitory concentration against HCMV protease.
J Med Chem 47: 1893-9 (2004)
Article DOI: 10.1021/jm030540h
BindingDB Entry DOI: 10.7270/Q2765DRK