null
SMILES: FC(F)(F)S(=O)(=O)Nc1ccc2c(\C=C\c3ccc4ccc(Cl)cc4n3)cccc2c1
InChI Key: InChIKey=YRFSNGDUAYYWPE-VMPITWQZSA-N
Activity Spreadsheet -- Enzyme Inhibition Constant Data from BindingDB
Found 1 hit for monomerid = 50143626
Trg + Lig
Ki
nM
ΔG°
kcal/mole
IC50
nM
Kd
nM
EC50/IC50
nM
koff
s-1
kon
M-1s-1
pHTemp
°C
Capsid scaffolding protein
(Human cytomegalovirus (strain AD169) (HHV-5) (Huma...)
BDBM50143626
(CHEMBL57617 | N-{5-[2-(7-Chloro-quinolin-2-yl)-vin...)
Show SMILES FC(F)(F)S(=O)(=O)Nc1ccc2c(\C=C\c3ccc4ccc(Cl)cc4n3)cccc2c1
Show InChI InChI=1S/C22H14ClF3N2O2S/c23-17-7-4-15-6-9-18(27-21(15)13-17)8-5-14-2-1-3-16-12-19(10-11-20(14)16)28-31(29,30)22(24,25)26/h1-13,28H/b8-5+
n/an/a 15.1n/an/an/an/an/an/a
Wyeth Research
Curated by ChEMBL
Assay Description
Inhibitory concentration against HCMV protease.
J Med Chem 47: 1893-9 (2004)
Article DOI: 10.1021/jm030540h
BindingDB Entry DOI: 10.7270/Q2765DRK