BDBM50143638 CHEMBL57565::N-[5-(3-Bromo-benzyloxy)-naphthalen-2-yl]-terephthalamic acid
SMILES: OC(=O)c1ccc(cc1)C(=O)Nc1ccc2c(OCc3cccc(Br)c3)cccc2c1
InChI Key: InChIKey=VXNJJIJNDCLWNQ-UHFFFAOYSA-N
Data: 1 IC50
Activity Spreadsheet -- Enzyme Inhibition Constant Data from BindingDB
Found 1 hit for monomerid = 50143638
Trg + Lig
Ki
nM
ΔG°
kcal/mole
IC50
nM
Kd
nM
EC50/IC50
nM
koff
s-1
kon
M-1s-1
pHTemp
°C
Capsid scaffolding protein
(Human cytomegalovirus (strain AD169) (HHV-5) (Huma...)
BDBM50143638
(CHEMBL57565 | N-[5-(3-Bromo-benzyloxy)-naphthalen-...)
Show SMILES OC(=O)c1ccc(cc1)C(=O)Nc1ccc2c(OCc3cccc(Br)c3)cccc2c1
Show InChI InChI=1S/C25H18BrNO4/c26-20-5-1-3-16(13-20)15-31-23-6-2-4-19-14-21(11-12-22(19)23)27-24(28)17-7-9-18(10-8-17)25(29)30/h1-14H,15H2,(H,27,28)(H,29,30)
n/an/a 6.10n/an/an/an/an/an/a
Wyeth Research
Curated by ChEMBL
Assay Description
Inhibitory concentration against HCMV protease.
J Med Chem 47: 1893-9 (2004)
Article DOI: 10.1021/jm030540h
BindingDB Entry DOI: 10.7270/Q2765DRK