BDBM50143639 CHEMBL55962::N-{5-[(E)-2-(7-Chloro-quinolin-2-yl)-vinyl]-naphthalen-2-yl}-benzamide
SMILES: Clc1ccc2ccc(\C=C\c3cccc4cc(NC(=O)c5ccccc5)ccc34)nc2c1
InChI Key: InChIKey=AGHFPZUBXGYDHC-JLHYYAGUSA-N
Data: 1 IC50
Activity Spreadsheet -- Enzyme Inhibition Constant Data from BindingDB
Found 1 hit for monomerid = 50143639
Trg + Lig
Ki
nM
ΔG°
kcal/mole
IC50
nM
Kd
nM
EC50/IC50
nM
koff
s-1
kon
M-1s-1
pHTemp
°C
Human herpes virus 5 capsid protein P40
(Human cytomegalovirus (strain AD169) (HHV-5) (Huma...)
BDBM50143639
(CHEMBL55962 | N-{5-[(E)-2-(7-Chloro-quinolin-2-yl)...)
Show SMILES Clc1ccc2ccc(\C=C\c3cccc4cc(NC(=O)c5ccccc5)ccc34)nc2c1
Show InChI InChI=1S/C28H19ClN2O/c29-23-12-9-20-11-14-24(30-27(20)18-23)13-10-19-7-4-8-22-17-25(15-16-26(19)22)31-28(32)21-5-2-1-3-6-21/h1-18H,(H,31,32)/b13-10+
n/an/a>50n/an/an/an/an/an/a
Wyeth Research
Curated by ChEMBL
Assay Description
Inhibitory concentration against HCMV protease.
J Med Chem 47: 1893-9 (2004)
Article DOI: 10.1021/jm030540h
BindingDB Entry DOI: 10.7270/Q2765DRK