BDBM50143642 CHEMBL56701::N-{5-[(E)-2-(6-Chloro-quinolin-2-yl)-vinyl]-naphthalen-2-yl}-acetamide
SMILES: CC(=O)Nc1ccc2c(\C=C\c3ccc4cc(Cl)ccc4n3)cccc2c1
InChI Key: InChIKey=DXMUQWKOVWSCPA-VMPITWQZSA-N
Data: 1 IC50
Activity Spreadsheet -- Enzyme Inhibition Constant Data from BindingDB
Found 1 hit for monomerid = 50143642
Trg + Lig
Ki
nM
ΔG°
kcal/mole
IC50
nM
Kd
nM
EC50/IC50
nM
koff
s-1
kon
M-1s-1
pHTemp
°C
Human herpes virus 5 capsid protein P40
(Human cytomegalovirus (strain AD169) (HHV-5) (Huma...)
BDBM50143642
(CHEMBL56701 | N-{5-[(E)-2-(6-Chloro-quinolin-2-yl)...)
Show SMILES CC(=O)Nc1ccc2c(\C=C\c3ccc4cc(Cl)ccc4n3)cccc2c1
Show InChI InChI=1S/C23H17ClN2O/c1-15(27)25-21-10-11-22-16(3-2-4-17(22)14-21)5-8-20-9-6-18-13-19(24)7-12-23(18)26-20/h2-14H,1H3,(H,25,27)/b8-5+
n/an/a 43n/an/an/an/an/an/a
Wyeth Research
Curated by ChEMBL
Assay Description
Inhibitory concentration against HCMV protease.
J Med Chem 47: 1893-9 (2004)
Article DOI: 10.1021/jm030540h
BindingDB Entry DOI: 10.7270/Q2765DRK