BDBM50143839 5-[2-(4-Carbamimidoyl-phenyl)-1-oxo-2,8-diaza-spiro[4.5]dec-8-yl]-5-oxo-3-phenyl-pentanoic acid::CHEMBL62713
SMILES: NC(=N)c1ccc(cc1)N1CCC2(CCN(CC2)C(=O)CC(CC(O)=O)c2ccccc2)C1=O
InChI Key: InChIKey=FSXBNSIKAWONDX-UHFFFAOYSA-N
Data: 2 IC50
Activity Spreadsheet -- Enzyme Inhibition Constant Data from BindingDB
Found 2 hits for monomerid = 50143839
Trg + Lig
Ki
nM
ΔG°
kcal/mole
IC50
nM
Kd
nM
EC50/IC50
nM
koff
s-1
kon
M-1s-1
pHTemp
°C
Integrin alpha-IIb/beta-3
(Homo sapiens (Human))
BDBM50143839
(5-[2-(4-Carbamimidoyl-phenyl)-1-oxo-2,8-diaza-spir...)
Show SMILES NC(=N)c1ccc(cc1)N1CCC2(CCN(CC2)C(=O)CC(CC(O)=O)c2ccccc2)C1=O
Show InChI InChI=1S/C26H30N4O4/c27-24(28)19-6-8-21(9-7-19)30-15-12-26(25(30)34)10-13-29(14-11-26)22(31)16-20(17-23(32)33)18-4-2-1-3-5-18/h1-9,20H,10-17H2,(H3,27,28)(H,32,33)
n/an/a 149n/an/an/an/an/an/a
Millennium Pharmaceuticals Inc.
Curated by ChEMBL
Assay Description
Inhibition of platelet aggregation induced by 20 microM adenosine 5-diphosphate (ADP) in citrated human platelet rich plasma (h-PRP)
J Med Chem 47: 2037-61 (2004)
Article DOI: 10.1021/jm030354b
BindingDB Entry DOI: 10.7270/Q2FQ9W1H
Integrin alpha-IIb/beta-3
(Homo sapiens (Human))
BDBM50143839
(5-[2-(4-Carbamimidoyl-phenyl)-1-oxo-2,8-diaza-spir...)
Show SMILES NC(=N)c1ccc(cc1)N1CCC2(CCN(CC2)C(=O)CC(CC(O)=O)c2ccccc2)C1=O
Show InChI InChI=1S/C26H30N4O4/c27-24(28)19-6-8-21(9-7-19)30-15-12-26(25(30)34)10-13-29(14-11-26)22(31)16-20(17-23(32)33)18-4-2-1-3-5-18/h1-9,20H,10-17H2,(H3,27,28)(H,32,33)
n/an/a 90n/an/an/an/an/an/a
Millennium Pharmaceuticals Inc.
Curated by ChEMBL
Assay Description
Tested for inhibition of the binding of fibrinogen to purified human GPIIb-IIIa in a 96-well format (ELISA assay)
J Med Chem 47: 2037-61 (2004)
Article DOI: 10.1021/jm030354b
BindingDB Entry DOI: 10.7270/Q2FQ9W1H