BDBM50143850 2-Butoxycarbonylamino-5-[2-(4-carbamimidoyl-phenyl)-1-oxo-2,8-diaza-spiro[4.5]dec-8-yl]-5-oxo-pentanoic acid::CHEMBL65432
SMILES: CCCCOC(=O)N[C@@H](CCC(=O)N1CCC2(CCN(C2=O)c2ccc(cc2)C(N)=N)CC1)C(O)=O
InChI Key: InChIKey=XIWNZCZUNRLAND-IBGZPJMESA-N
Data: 2 IC50
Activity Spreadsheet -- Enzyme Inhibition Constant Data from BindingDB
Found 2 hits for monomerid = 50143850
Trg + Lig
Ki
nM
ΔG°
kcal/mole
IC50
nM
Kd
nM
EC50/IC50
nM
koff
s-1
kon
M-1s-1
pHTemp
°C
Integrin alpha-IIb/beta-3
(Homo sapiens (Human))
BDBM50143850
(2-Butoxycarbonylamino-5-[2-(4-carbamimidoyl-phenyl...)
Show SMILES CCCCOC(=O)N[C@@H](CCC(=O)N1CCC2(CCN(C2=O)c2ccc(cc2)C(N)=N)CC1)C(O)=O
Show InChI InChI=1S/C25H35N5O6/c1-2-3-16-36-24(35)28-19(22(32)33)8-9-20(31)29-13-10-25(11-14-29)12-15-30(23(25)34)18-6-4-17(5-7-18)21(26)27/h4-7,19H,2-3,8-16H2,1H3,(H3,26,27)(H,28,35)(H,32,33)/t19-/m0/s1
n/an/a 5n/an/an/an/an/an/a
Millennium Pharmaceuticals Inc.
Curated by ChEMBL
Assay Description
Tested for inhibition of the binding of fibrinogen to purified human GPIIb-IIIa in a 96-well format (ELISA assay)
J Med Chem 47: 2037-61 (2004)
Article DOI: 10.1021/jm030354b
BindingDB Entry DOI: 10.7270/Q2FQ9W1H
Integrin alpha-IIb/beta-3
(Homo sapiens (Human))
BDBM50143850
(2-Butoxycarbonylamino-5-[2-(4-carbamimidoyl-phenyl...)
Show SMILES CCCCOC(=O)N[C@@H](CCC(=O)N1CCC2(CCN(C2=O)c2ccc(cc2)C(N)=N)CC1)C(O)=O
Show InChI InChI=1S/C25H35N5O6/c1-2-3-16-36-24(35)28-19(22(32)33)8-9-20(31)29-13-10-25(11-14-29)12-15-30(23(25)34)18-6-4-17(5-7-18)21(26)27/h4-7,19H,2-3,8-16H2,1H3,(H3,26,27)(H,28,35)(H,32,33)/t19-/m0/s1
n/an/a 66n/an/an/an/an/an/a
Millennium Pharmaceuticals Inc.
Curated by ChEMBL
Assay Description
Inhibition of platelet aggregation induced by 20 microM adenosine 5-diphosphate (ADP) in citrated human platelet rich plasma (h-PRP)
J Med Chem 47: 2037-61 (2004)
Article DOI: 10.1021/jm030354b
BindingDB Entry DOI: 10.7270/Q2FQ9W1H