BDBM50143889 CHEMBL3758492
SMILES: ONC(=O)CCCCCC(=O)N\N=C\c1ccc(cc1)-c1cncnc1
InChI Key: InChIKey=IMLRCIJPRAFHAV-UFFVCSGVSA-N
Data: 3 IC50
Activity Spreadsheet -- Enzyme Inhibition Constant Data from BindingDB
Found 3 hits for monomerid = 50143889
Trg + Lig
Ki
nM
ΔG°
kcal/mole
IC50
nM
Kd
nM
EC50/IC50
nM
koff
s-1
kon
M-1s-1
pHTemp
°C
Histone deacetylase 1
(Homo sapiens (Human))
BDBM50143889
(CHEMBL3758492)
Show SMILES ONC(=O)CCCCCC(=O)N\N=C\c1ccc(cc1)-c1cncnc1
Show InChI InChI=1S/C18H21N5O3/c24-17(4-2-1-3-5-18(25)23-26)22-21-10-14-6-8-15(9-7-14)16-11-19-13-20-12-16/h6-13,26H,1-5H2,(H,22,24)(H,23,25)/b21-10+
NCI pathway
Reactome pathway
n/an/a 3.20n/an/an/an/an/an/a
Massachusetts General Hospital
Curated by ChEMBL
Assay Description
Inhibition of human recombinant HDAC1 using acetyllysine tripeptide coupled with 7-amino-4-methylcoumarin as substrate by fluorescence assay
Bioorg Med Chem Lett 26: 1265-71 (2016)
BindingDB Entry DOI: 10.7270/Q2H99714
Histone deacetylase 3
(Homo sapiens (Human))
BDBM50143889
(CHEMBL3758492)
Show SMILES ONC(=O)CCCCCC(=O)N\N=C\c1ccc(cc1)-c1cncnc1
Show InChI InChI=1S/C18H21N5O3/c24-17(4-2-1-3-5-18(25)23-26)22-21-10-14-6-8-15(9-7-14)16-11-19-13-20-12-16/h6-13,26H,1-5H2,(H,22,24)(H,23,25)/b21-10+
NCI pathway
Reactome pathway
n/an/a 2.40n/an/an/an/an/an/a
Massachusetts General Hospital
Curated by ChEMBL
Assay Description
Inhibition of human recombinant HDAC3 using acetyllysine tripeptide coupled with 7-amino-4-methylcoumarin as substrate by fluorescence assay
Bioorg Med Chem Lett 26: 1265-71 (2016)
BindingDB Entry DOI: 10.7270/Q2H99714
Histone deacetylase 2
(Homo sapiens (Human))
BDBM50143889
(CHEMBL3758492)
Show SMILES ONC(=O)CCCCCC(=O)N\N=C\c1ccc(cc1)-c1cncnc1
Show InChI InChI=1S/C18H21N5O3/c24-17(4-2-1-3-5-18(25)23-26)22-21-10-14-6-8-15(9-7-14)16-11-19-13-20-12-16/h6-13,26H,1-5H2,(H,22,24)(H,23,25)/b21-10+
NCI pathway
Reactome pathway
n/an/a 21n/an/an/an/an/an/a
Massachusetts General Hospital
Curated by ChEMBL
Assay Description
Inhibition of human recombinant HDAC2 using acetyllysine tripeptide coupled with 7-amino-4-methylcoumarin as substrate by fluorescence assay
Bioorg Med Chem Lett 26: 1265-71 (2016)
BindingDB Entry DOI: 10.7270/Q2H99714