BDBM50143895 CHEMBL3758251
SMILES: ONC(=O)CCCCC(=O)N\N=C\c1ccc(cc1)-c1ccccc1
InChI Key: InChIKey=JFEZCHSJOLHFSK-XSFVSMFZSA-N
Data: 3 IC50
Activity Spreadsheet -- Enzyme Inhibition Constant Data from BindingDB
Found 3 hits for monomerid = 50143895
Trg + Lig
Ki
nM
ΔG°
kcal/mole
IC50
nM
Kd
nM
EC50/IC50
nM
koff
s-1
kon
M-1s-1
pHTemp
°C
Histone deacetylase 1
(Homo sapiens (Human))
BDBM50143895
(CHEMBL3758251)
Show SMILES ONC(=O)CCCCC(=O)N\N=C\c1ccc(cc1)-c1ccccc1
Show InChI InChI=1S/C19H21N3O3/c23-18(8-4-5-9-19(24)22-25)21-20-14-15-10-12-17(13-11-15)16-6-2-1-3-7-16/h1-3,6-7,10-14,25H,4-5,8-9H2,(H,21,23)(H,22,24)/b20-14+
NCI pathway
Reactome pathway
n/an/a 19n/an/an/an/an/an/a
Massachusetts General Hospital
Curated by ChEMBL
Assay Description
Inhibition of human recombinant HDAC1 using acetyllysine tripeptide coupled with 7-amino-4-methylcoumarin as substrate by fluorescence assay
Bioorg Med Chem Lett 26: 1265-71 (2016)
BindingDB Entry DOI: 10.7270/Q2H99714
Histone deacetylase 3
(Homo sapiens (Human))
BDBM50143895
(CHEMBL3758251)
Show SMILES ONC(=O)CCCCC(=O)N\N=C\c1ccc(cc1)-c1ccccc1
Show InChI InChI=1S/C19H21N3O3/c23-18(8-4-5-9-19(24)22-25)21-20-14-15-10-12-17(13-11-15)16-6-2-1-3-7-16/h1-3,6-7,10-14,25H,4-5,8-9H2,(H,21,23)(H,22,24)/b20-14+
NCI pathway
Reactome pathway
n/an/a 61n/an/an/an/an/an/a
Massachusetts General Hospital
Curated by ChEMBL
Assay Description
Inhibition of human recombinant HDAC3 using acetyllysine tripeptide coupled with 7-amino-4-methylcoumarin as substrate by fluorescence assay
Bioorg Med Chem Lett 26: 1265-71 (2016)
BindingDB Entry DOI: 10.7270/Q2H99714
Histone deacetylase 2
(Homo sapiens (Human))
BDBM50143895
(CHEMBL3758251)
Show SMILES ONC(=O)CCCCC(=O)N\N=C\c1ccc(cc1)-c1ccccc1
Show InChI InChI=1S/C19H21N3O3/c23-18(8-4-5-9-19(24)22-25)21-20-14-15-10-12-17(13-11-15)16-6-2-1-3-7-16/h1-3,6-7,10-14,25H,4-5,8-9H2,(H,21,23)(H,22,24)/b20-14+
NCI pathway
Reactome pathway
n/an/a 33n/an/an/an/an/an/a
Massachusetts General Hospital
Curated by ChEMBL
Assay Description
Inhibition of human recombinant HDAC2 using acetyllysine tripeptide coupled with 7-amino-4-methylcoumarin as substrate by fluorescence assay
Bioorg Med Chem Lett 26: 1265-71 (2016)
BindingDB Entry DOI: 10.7270/Q2H99714