BDBM50144083 2-{4-(5-Chloro-1H-indole-2-sulfonyl)-1-[4-(1-methyl-4,5-dihydro-1H-imidazol-2-yl)-benzoyl]-piperazin-2-yl}-acetamide::CHEMBL293248
SMILES: CN1CCN=C1c1ccc(cc1)C(=O)N1CCN(CC1CC(N)=O)S(=O)(=O)c1cc2cc(Cl)ccc2[nH]1
InChI Key: InChIKey=PSNSLGQPNFVUHU-UHFFFAOYSA-N
Data: 1 IC50
Activity Spreadsheet -- Enzyme Inhibition Constant Data from BindingDB
Found 1 hit for monomerid = 50144083
Trg + Lig
Ki
nM
ΔG°
kcal/mole
IC50
nM
Kd
nM
EC50/IC50
nM
koff
s-1
kon
M-1s-1
pHTemp
°C
Coagulation factor X
(Homo sapiens (Human))
BDBM50144083
(2-{4-(5-Chloro-1H-indole-2-sulfonyl)-1-[4-(1-methy...)
Show SMILES CN1CCN=C1c1ccc(cc1)C(=O)N1CCN(CC1CC(N)=O)S(=O)(=O)c1cc2cc(Cl)ccc2[nH]1 |c:4|
Show InChI InChI=1S/C25H27ClN6O4S/c1-30-9-8-28-24(30)16-2-4-17(5-3-16)25(34)32-11-10-31(15-20(32)14-22(27)33)37(35,36)23-13-18-12-19(26)6-7-21(18)29-23/h2-7,12-13,20,29H,8-11,14-15H2,1H3,(H2,27,33)
Reactome pathway
n/an/a 18n/an/an/an/an/an/a
Millennium Pharmaceuticals, Inc.
Curated by ChEMBL
Assay Description
In vitro inhibitory activity against Coagulation factor X was determined
Bioorg Med Chem Lett 14: 2073-8 (2004)
Article DOI: 10.1016/j.bmcl.2004.02.049
BindingDB Entry DOI: 10.7270/Q2P84B98