BDBM50144118 4-(5-Chloro-1H-indole-2-sulfonyl)-1-[4-(1-methyl-4,5-dihydro-1H-imidazol-2-yl)-benzoyl]-piperazine-2-carboxylic acid::CHEMBL61950
SMILES: CN1CCN=C1c1ccc(cc1)C(=O)N1CCN(CC1C(O)=O)S(=O)(=O)c1cc2cc(Cl)ccc2[nH]1
InChI Key: InChIKey=BQHIZKVMARLRRN-UHFFFAOYSA-N
Data: 1 IC50
Activity Spreadsheet -- Enzyme Inhibition Constant Data from BindingDB
Found 1 hit for monomerid = 50144118
Trg + Lig
Ki
nM
ΔG°
kcal/mole
IC50
nM
Kd
nM
EC50/IC50
nM
koff
s-1
kon
M-1s-1
pHTemp
°C
Coagulation factor X
(Homo sapiens (Human))
BDBM50144118
(4-(5-Chloro-1H-indole-2-sulfonyl)-1-[4-(1-methyl-4...)
Show SMILES CN1CCN=C1c1ccc(cc1)C(=O)N1CCN(CC1C(O)=O)S(=O)(=O)c1cc2cc(Cl)ccc2[nH]1 |c:4|
Show InChI InChI=1S/C24H24ClN5O5S/c1-28-9-8-26-22(28)15-2-4-16(5-3-15)23(31)30-11-10-29(14-20(30)24(32)33)36(34,35)21-13-17-12-18(25)6-7-19(17)27-21/h2-7,12-13,20,27H,8-11,14H2,1H3,(H,32,33)
Reactome pathway
n/an/a 12n/an/an/an/an/an/a
Millennium Pharmaceuticals, Inc.
Curated by ChEMBL
Assay Description
In vitro inhibitory activity against Coagulation factor X was determined
Bioorg Med Chem Lett 14: 2073-8 (2004)
Article DOI: 10.1016/j.bmcl.2004.02.049
BindingDB Entry DOI: 10.7270/Q2P84B98