BDBM50144337 3-(6-Amino-pyridin-3-yl)-2-[1-(4-methyl-pentyl)-1H-imidazol-4-yl]-propionic acid::CHEMBL70177
SMILES: CC(C)CCCn1cnc(c1)C(Cc1ccc(N)nc1)C(O)=O
InChI Key: InChIKey=UFHFBHSKTSVCMN-UHFFFAOYSA-N
Data: 2 IC50
Activity Spreadsheet -- Enzyme Inhibition Constant Data from BindingDB
Found 2 hits for monomerid = 50144337
Trg + Lig
Ki
nM
ΔG°
kcal/mole
IC50
nM
Kd
nM
EC50/IC50
nM
koff
s-1
kon
M-1s-1
pHTemp
°C
Thrombin-activatable fibrinolysis (TAFI)
(Homo sapiens (Human))
BDBM50144337
(3-(6-Amino-pyridin-3-yl)-2-[1-(4-methyl-pentyl)-1H...)
Show SMILES CC(C)CCCn1cnc(c1)C(Cc1ccc(N)nc1)C(O)=O
Show InChI InChI=1S/C17H24N4O2/c1-12(2)4-3-7-21-10-15(20-11-21)14(17(22)23)8-13-5-6-16(18)19-9-13/h5-6,9-12,14H,3-4,7-8H2,1-2H3,(H2,18,19)(H,22,23)
Reactome pathway
n/an/a 4n/an/an/an/an/an/a
Merck Research Laboratories
Curated by ChEMBL
Assay Description
Inhibition of human carboxypeptidase B (CPB)
Bioorg Med Chem Lett 14: 2141-5 (2004)
Article DOI: 10.1016/j.bmcl.2004.02.033
BindingDB Entry DOI: 10.7270/Q2N8797S
Carboxypeptidase B2 isoform A
(Homo sapiens (Human))
BDBM50144337
(3-(6-Amino-pyridin-3-yl)-2-[1-(4-methyl-pentyl)-1H...)
Show SMILES CC(C)CCCn1cnc(c1)C(Cc1ccc(N)nc1)C(O)=O
Show InChI InChI=1S/C17H24N4O2/c1-12(2)4-3-7-21-10-15(20-11-21)14(17(22)23)8-13-5-6-16(18)19-9-13/h5-6,9-12,14H,3-4,7-8H2,1-2H3,(H2,18,19)(H,22,23)
Reactome pathway
n/an/a 2n/an/an/an/an/an/a
Merck Research Laboratories
Curated by ChEMBL
Assay Description
Inhibitory potency against human TAFIa (thrombin-activatable fibrinolysis inhibitor)
Bioorg Med Chem Lett 14: 2141-5 (2004)
Article DOI: 10.1016/j.bmcl.2004.02.033
BindingDB Entry DOI: 10.7270/Q2N8797S