BDBM50144349 4-[2-((S)-4,4-Difluoro-2-{[(2S,4S)-1-(2-isobutoxycarbonylamino-3-methyl-butyryl)-4-phenyl-pyrrolidine-2-carbonyl]-amino}-butyrylamino)-ethyl]-3-(S)-fluoro-5-fluoro-benzoic acid::CHEMBL68034
SMILES: CC(C)COC(=O)N[C@@H](C(C)C)C(=O)N1C[C@@H](C[C@H]1C(=O)N[C@@H](CC(F)F)C(=O)NCCc1c(F)cc(cc1F)C(O)=O)c1ccccc1
InChI Key: InChIKey=AMZZGYSKKBGEAC-NLALRGLNSA-N
Data: 1 KI  1 IC50
Activity Spreadsheet -- Enzyme Inhibition Constant Data from BindingDB
Found 2 hits for monomerid = 50144349
Trg + Lig
Ki
nM
ΔG°
kcal/mole
IC50
nM
Kd
nM
EC50/IC50
nM
koff
s-1
kon
M-1s-1
pHTemp
°C
Hepatitis C virus serine protease, NS3/NS4A
(Hepatitis C virus)
BDBM50144349
(4-[2-((S)-4,4-Difluoro-2-{[(2S,4S)-1-(2-isobutoxyc...)
Show SMILES CC(C)COC(=O)N[C@@H](C(C)C)C(=O)N1C[C@@H](C[C@H]1C(=O)N[C@@H](CC(F)F)C(=O)NCCc1c(F)cc(cc1F)C(O)=O)c1ccccc1
Show InChI InChI=1S/C34H42F4N4O7/c1-18(2)17-49-34(48)41-29(19(3)4)32(45)42-16-22(20-8-6-5-7-9-20)14-27(42)31(44)40-26(15-28(37)38)30(43)39-11-10-23-24(35)12-21(33(46)47)13-25(23)36/h5-9,12-13,18-19,22,26-29H,10-11,14-17H2,1-4H3,(H,39,43)(H,40,44)(H,41,48)(H,46,47)/t22-,26+,27+,29+/m1/s1
45n/an/an/an/an/an/an/an/a
Merck Research Laboratories
Curated by ChEMBL
Assay Description
Inhibitory activity against Hepatitis C virus Non structural protein 3 serine protease/Non structural protein 4A serine protease
Bioorg Med Chem Lett 14: 4575-9 (2004)
Article DOI: 10.1016/j.bmcl.2004.05.093
BindingDB Entry DOI: 10.7270/Q27S7PHC
Genome polyprotein
(Hepatitis C virus (HCV))
BDBM50144349
(4-[2-((S)-4,4-Difluoro-2-{[(2S,4S)-1-(2-isobutoxyc...)
Show SMILES CC(C)COC(=O)N[C@@H](C(C)C)C(=O)N1C[C@@H](C[C@H]1C(=O)N[C@@H](CC(F)F)C(=O)NCCc1c(F)cc(cc1F)C(O)=O)c1ccccc1
Show InChI InChI=1S/C34H42F4N4O7/c1-18(2)17-49-34(48)41-29(19(3)4)32(45)42-16-22(20-8-6-5-7-9-20)14-27(42)31(44)40-26(15-28(37)38)30(43)39-11-10-23-24(35)12-21(33(46)47)13-25(23)36/h5-9,12-13,18-19,22,26-29H,10-11,14-17H2,1-4H3,(H,39,43)(H,40,44)(H,41,48)(H,46,47)/t22-,26+,27+,29+/m1/s1
n/an/a 900n/an/an/an/an/an/a
IRBM, MRL Rome
Curated by ChEMBL
Assay Description
Inhibition of Hepatitis C virus NS3 protease in vitro.
Bioorg Med Chem Lett 14: 2151-4 (2004)
Article DOI: 10.1016/j.bmcl.2004.02.032
BindingDB Entry DOI: 10.7270/Q2HH6JJH