null
SMILES: COc1cccc(c1)C(=O)NC1C(O)[C@@H](COP([O-])(=O)OP(O)(=O)OC[C@H]2O[C@H](C(O)C2O)[n+]2ccc(cc2)C(N)=O)O[C@H]1n1cnc2c(NCc3cccc4ccccc34)ncnc12
InChI Key: InChIKey=SYQJJJLLKFPWON-ZQUZFXMUSA-M
Activity Spreadsheet -- Enzyme Inhibition Constant Data from BindingDB
Found 1 hit for monomerid = 50144452
Trg + Lig
Ki
nM
ΔG°
kcal/mole
IC50
nM
Kd
nM
EC50/IC50
nM
koff
s-1
kon
M-1s-1
pHTemp
°C
Glyceraldehyde-3-phosphate dehydrogenase
(Homo sapiens (Human))
BDBM50144452
(Adenosine analogue | CHEMBL3559427)
Show SMILES COc1cccc(c1)C(=O)NC1C(O)[C@@H](COP([O-])(=O)OP(O)(=O)OC[C@H]2O[C@H](C(O)C2O)[n+]2ccc(cc2)C(N)=O)O[C@H]1n1cnc2c(NCc3cccc4ccccc34)ncnc12
Show InChI InChI=1S/C40H42N8O15P2/c1-58-26-10-5-8-24(16-26)38(53)46-30-32(49)28(61-39(30)48-21-45-31-36(43-20-44-37(31)48)42-17-25-9-4-7-22-6-2-3-11-27(22)25)18-59-64(54,55)63-65(56,57)60-19-29-33(50)34(51)40(62-29)47-14-12-23(13-15-47)35(41)52/h2-16,20-21,28-30,32-34,39-40,49-51H,17-19H2,1H3,(H5-,41,42,43,44,46,52,53,54,55,56,57)/p-1/t28-,29-,30?,32?,33?,34?,39-,40-/m1/s1
NCI pathway
Reactome pathway
n/an/a 100n/an/an/an/an/an/a
Universidade Federal de Minas Gerais
Curated by ChEMBL
Assay Description
Inhibitory concentration of compound against glyceraldehyde-3-phosphate dehydrogenase was determined
Bioorg Med Chem Lett 14: 2199-204 (2004)
Article DOI: 10.1016/j.bmcl.2004.02.025
BindingDB Entry DOI: 10.7270/Q20K2810