BDBM50144544 CHEMBL3759129
SMILES: OC(=O)c1cc2CS(=O)(=O)c3c(F)cccc3-c2s1
InChI Key: InChIKey=XVYUSQYWBHVTBV-UHFFFAOYSA-N
Data: 2 EC50
Activity Spreadsheet -- Enzyme Inhibition Constant Data from BindingDB
Found 2 hits for monomerid = 50144544
Trg + Lig
Ki
nM
ΔG°
kcal/mole
IC50
nM
Kd
nM
EC50/IC50
nM
koff
s-1
kon
M-1s-1
pHTemp
°C
Palmitoleoyl-protein carboxylesterase NOTUM
(Homo sapiens (Human))
BDBM50144544
(CHEMBL3759129)
Show SMILES OC(=O)c1cc2CS(=O)(=O)c3c(F)cccc3-c2s1
Show InChI InChI=1S/C12H7FO4S2/c13-8-3-1-2-7-10-6(4-9(18-10)12(14)15)5-19(16,17)11(7)8/h1-4H,5H2,(H,14,15)
n/an/an/an/a 183n/an/an/an/a
Lexicon Pharmaceuticals
Curated by ChEMBL
Assay Description
Inhibition of human notum pectinacetylesterase expressed in 293F cells by TCF/LEF CellSensor assay
Bioorg Med Chem Lett 26: 1184-7 (2016)
BindingDB Entry DOI: 10.7270/Q2QV3PBN
Palmitoleoyl-protein carboxylesterase NOTUM
(Mus musculus)
BDBM50144544
(CHEMBL3759129)
Show SMILES OC(=O)c1cc2CS(=O)(=O)c3c(F)cccc3-c2s1
Show InChI InChI=1S/C12H7FO4S2/c13-8-3-1-2-7-10-6(4-9(18-10)12(14)15)5-19(16,17)11(7)8/h1-4H,5H2,(H,14,15)
n/an/an/an/a 84n/an/an/an/a
Lexicon Pharmaceuticals
Curated by ChEMBL
Assay Description
Inhibition of mouse notum pectinacetylesterase expressed in 293F cells by TCF/LEF CellSensor assay
Bioorg Med Chem Lett 26: 1184-7 (2016)
BindingDB Entry DOI: 10.7270/Q2QV3PBN