null
SMILES: Cc1ccc(CC(COC(=O)C(C)(C)C)CN(O)C(=S)NCc2ccc(NS(C)(=O)=O)cc2Cl)cc1C
InChI Key: InChIKey=NDFWAJBPUCFIPY-UHFFFAOYSA-N
Activity Spreadsheet -- Enzyme Inhibition Constant Data from BindingDB
Found 2 hits for monomerid = 50144666
Trg + Lig
Ki
nM
ΔG°
kcal/mole
IC50
nM
Kd
nM
EC50/IC50
nM
koff
s-1
kon
M-1s-1
pHTemp
°C
Transient receptor potential cation channel subfamily V member 1
(Rattus norvegicus (rat))
BDBM50144666
(2,2-Dimethyl-propionic acid 2-(3,4-dimethyl-benzyl...)
Show SMILES Cc1ccc(CC(COC(=O)C(C)(C)C)CN(O)C(=S)NCc2ccc(NS(C)(=O)=O)cc2Cl)cc1C
Show InChI InChI=1S/C26H36ClN3O5S2/c1-17-7-8-19(11-18(17)2)12-20(16-35-24(31)26(3,4)5)15-30(32)25(36)28-14-21-9-10-22(13-23(21)27)29-37(6,33)34/h7-11,13,20,29,32H,12,14-16H2,1-6H3,(H,28,36)
Reactome pathway
220n/an/an/an/an/an/an/an/a
Seoul National University
Curated by ChEMBL
Assay Description
Binding affinity towards rat vanilloid receptor subtype 1 expressed in CHO cells by [3H]-RTX displacement.
Bioorg Med Chem Lett 14: 2291-7 (2004)
Article DOI: 10.1016/j.bmcl.2004.02.002
BindingDB Entry DOI: 10.7270/Q2TT4QCG
Transient receptor potential cation channel subfamily V member 1
(Rattus norvegicus (rat))
BDBM50144666
(2,2-Dimethyl-propionic acid 2-(3,4-dimethyl-benzyl...)
Show SMILES Cc1ccc(CC(COC(=O)C(C)(C)C)CN(O)C(=S)NCc2ccc(NS(C)(=O)=O)cc2Cl)cc1C
Show InChI InChI=1S/C26H36ClN3O5S2/c1-17-7-8-19(11-18(17)2)12-20(16-35-24(31)26(3,4)5)15-30(32)25(36)28-14-21-9-10-22(13-23(21)27)29-37(6,33)34/h7-11,13,20,29,32H,12,14-16H2,1-6H3,(H,28,36)
Reactome pathway
n/an/a 757n/an/an/an/an/an/a
Seoul National University
Curated by ChEMBL
Assay Description
In vitro antagonist effect against 50 nM capsaicin-induced 45 [Ca2+] influx in vanilloid recptor expressing CHO cells
Bioorg Med Chem Lett 14: 2291-7 (2004)
Article DOI: 10.1016/j.bmcl.2004.02.002
BindingDB Entry DOI: 10.7270/Q2TT4QCG