BDBM50144699 6-(5-Bromo-2-ethoxy-phenyl)-N*4*-phenyl-pyrimidine-2,4-diamine::CHEMBL309911
SMILES: CCOc1ccc(Br)cc1-c1cc(Nc2ccccc2)nc(N)n1
InChI Key: InChIKey=SBSIILCOTQKDLV-UHFFFAOYSA-N
Data: 1 IC50
Activity Spreadsheet -- Enzyme Inhibition Constant Data from BindingDB
Found 1 hit for monomerid = 50144699
Trg + Lig
Ki
nM
ΔG°
kcal/mole
IC50
nM
Kd
nM
EC50/IC50
nM
koff
s-1
kon
M-1s-1
pHTemp
°C
1-acylglycerol-3-phosphate O-acyltransferase beta
(Homo sapiens (Human))
BDBM50144699
(6-(5-Bromo-2-ethoxy-phenyl)-N*4*-phenyl-pyrimidine...)
Show SMILES CCOc1ccc(Br)cc1-c1cc(Nc2ccccc2)nc(N)n1
Show InChI InChI=1S/C18H17BrN4O/c1-2-24-16-9-8-12(19)10-14(16)15-11-17(23-18(20)22-15)21-13-6-4-3-5-7-13/h3-11H,2H2,1H3,(H3,20,21,22,23)
Reactome pathway
n/an/a 120n/an/an/an/an/an/a
Cell Therapeutics, Inc
Curated by ChEMBL
Assay Description
Inhibitory activity against Lysophosphatidic acid acyltransferase-beta expressed in Sf9 insect cell membranes
Bioorg Med Chem Lett 14: 2303-8 (2004)
Article DOI: 10.1016/j.bmcl.2004.01.104
BindingDB Entry DOI: 10.7270/Q2Q23ZPH