BDBM50144702 6-(5-Chloro-2-ethoxy-phenyl)-N*4*-(1H-indazol-6-yl)-pyrimidine-2,4-diamine::CHEMBL74492
SMILES: CCOc1ccc(Cl)cc1-c1cc(Nc2ccc3c[nH]nc3c2)nc(N)n1
InChI Key: InChIKey=HJTYGBYWQGTVIS-UHFFFAOYSA-N
Data: 1 IC50
Activity Spreadsheet -- Enzyme Inhibition Constant Data from BindingDB
Found 1 hit for monomerid = 50144702
Trg + Lig
Ki
nM
ΔG°
kcal/mole
IC50
nM
Kd
nM
EC50/IC50
nM
koff
s-1
kon
M-1s-1
pHTemp
°C
1-acylglycerol-3-phosphate O-acyltransferase beta
(Homo sapiens (Human))
BDBM50144702
(6-(5-Chloro-2-ethoxy-phenyl)-N*4*-(1H-indazol-6-yl...)
Show SMILES CCOc1ccc(Cl)cc1-c1cc(Nc2ccc3c[nH]nc3c2)nc(N)n1
Show InChI InChI=1S/C19H17ClN6O/c1-2-27-17-6-4-12(20)7-14(17)16-9-18(25-19(21)24-16)23-13-5-3-11-10-22-26-15(11)8-13/h3-10H,2H2,1H3,(H,22,26)(H3,21,23,24,25)
Reactome pathway
n/an/a 24n/an/an/an/an/an/a
Cell Therapeutics, Inc
Curated by ChEMBL
Assay Description
Inhibitory activity against Lysophosphatidic acid acyltransferase-beta expressed in Sf9 insect cell membranes
Bioorg Med Chem Lett 14: 2303-8 (2004)
Article DOI: 10.1016/j.bmcl.2004.01.104
BindingDB Entry DOI: 10.7270/Q2Q23ZPH