BDBM50144966 CHEMBL3764577
SMILES: COc1cc2ncnc(-n3nc(nc3N)-c3ccccn3)c2cc1OCCN1CCCCC1
InChI Key: InChIKey=VXHADGLLQQCTNO-UHFFFAOYSA-N
Data: 1 IC50
Activity Spreadsheet -- Enzyme Inhibition Constant Data from BindingDB
Found 1 hit for monomerid = 50144966
Trg + Lig
Ki
nM
ΔG°
kcal/mole
IC50
nM
Kd
nM
EC50/IC50
nM
koff
s-1
kon
M-1s-1
pHTemp
°C
Serine-protein kinase ATM
(Homo sapiens (Human))
BDBM50144966
(CHEMBL3764577)
Show SMILES COc1cc2ncnc(-n3nc(nc3N)-c3ccccn3)c2cc1OCCN1CCCCC1
Show InChI InChI=1S/C23H26N8O2/c1-32-19-14-18-16(13-20(19)33-12-11-30-9-5-2-6-10-30)22(27-15-26-18)31-23(24)28-21(29-31)17-7-3-4-8-25-17/h3-4,7-8,13-15H,2,5-6,9-12H2,1H3,(H2,24,28,29)
n/an/a 5.60E+3n/an/an/an/an/an/a
Duke University School of Medicine
Curated by ChEMBL
Assay Description
Inhibition of ATM kinase in human MCF7 cells after 1 hr by immunofluorescence assay
J Med Chem 59: 559-77 (2016)
BindingDB Entry DOI: 10.7270/Q2TM7D0W