null
SMILES: COc1c(C(C)=O)c(OCc2ccc(COc3cc4occc4c(OC)c3C(C)=O)cc2)cc2occc12
InChI Key: InChIKey=VRUBZIYNJIZSSO-UHFFFAOYSA-N
Activity Spreadsheet -- Enzyme Inhibition Constant Data from BindingDB
Found 1 hit for monomerid = 50145046
Trg + Lig
Ki
nM
ΔG°
kcal/mole
IC50
nM
Kd
nM
EC50/IC50
nM
koff
s-1
kon
M-1s-1
pHTemp
°C
Potassium voltage-gated channel subfamily A member 3
(Homo sapiens (Human))
BDBM50145046
(1-{6-[4-(5-Acetyl-4-methoxy-benzofuran-6-yloxymeth...)
Show SMILES COc1c(C(C)=O)c(OCc2ccc(COc3cc4occc4c(OC)c3C(C)=O)cc2)cc2occc12
Show InChI InChI=1S/C30H26O8/c1-17(31)27-25(13-23-21(9-11-35-23)29(27)33-3)37-15-19-5-7-20(8-6-19)16-38-26-14-24-22(10-12-36-24)30(34-4)28(26)18(2)32/h5-14H,15-16H2,1-4H3
Reactome pathway
n/an/an/a 1.00E+3n/an/an/an/an/a
Institute of Medical Research Biotechnology Centre
Curated by ChEMBL
Assay Description
Dissociation constant for the blockage of voltage-gated potassium channel subunit Kv1.3 in human lymphocytes
J Med Chem 47: 2326-36 (2004)
Article DOI: 10.1021/jm030523s
BindingDB Entry DOI: 10.7270/Q28W3CRM