null
SMILES: COc1c(C(=O)\C=C\c2ccccc2)c(O)cc2occc12
InChI Key: InChIKey=SPFCYLTZEFTMIM-BQYQJAHWSA-N
Activity Spreadsheet -- Enzyme Inhibition Constant Data from BindingDB
Found 2 hits for monomerid = 50145058
Trg + Lig
Ki
nM
ΔG°
kcal/mole
IC50
nM
Kd
nM
EC50/IC50
nM
koff
s-1
kon
M-1s-1
pHTemp
°C
Potassium voltage-gated channel subfamily A member 3
(Homo sapiens (Human))
BDBM50145058
((E)-1-(6-Hydroxy-4-methoxy-benzofuran-5-yl)-3-phen...)
Show SMILES COc1c(C(=O)\C=C\c2ccccc2)c(O)cc2occc12
Show InChI InChI=1S/C18H14O4/c1-21-18-13-9-10-22-16(13)11-15(20)17(18)14(19)8-7-12-5-3-2-4-6-12/h2-11,20H,1H3/b8-7+
Reactome pathway
n/an/an/an/a 1.70E+4n/an/an/an/a
The Walter and Eliza Hall Institute of Medical Research
Curated by ChEMBL
Assay Description
Inhibition in Kv1.3 expressed in human L929 by patch clamp method
Bioorg Med Chem Lett 18: 2055-61 (2008)
Article DOI: 10.1016/j.bmcl.2008.01.099
BindingDB Entry DOI: 10.7270/Q2ZG6T27
Potassium voltage-gated channel subfamily A member 3
(Homo sapiens (Human))
BDBM50145058
((E)-1-(6-Hydroxy-4-methoxy-benzofuran-5-yl)-3-phen...)
Show SMILES COc1c(C(=O)\C=C\c2ccccc2)c(O)cc2occc12
Show InChI InChI=1S/C18H14O4/c1-21-18-13-9-10-22-16(13)11-15(20)17(18)14(19)8-7-12-5-3-2-4-6-12/h2-11,20H,1H3/b8-7+
Reactome pathway
n/an/an/a 1.70E+4n/an/an/an/an/a
Institute of Medical Research Biotechnology Centre
Curated by ChEMBL
Assay Description
Dissociation constant for the blockage of voltage-gated potassium channel subunit Kv1.3 in human lymphocytes
J Med Chem 47: 2326-36 (2004)
Article DOI: 10.1021/jm030523s
BindingDB Entry DOI: 10.7270/Q28W3CRM