BDBM50145062 1-[12b-hydroxy-1b,3a,10b-trimethyl-2,3,4,5-tetra(methylcarbonyloxy)-14-methylene-1a-methyloxycarbonyl-8-oxo-1a,1b,2,3,3a,3b,4,5,5a,6,8,10a,10b,11,12,12a,12b,13,14,14a-icosahydrooxireno[2',3':7,8]chryseno[2,1-c]oxepin-5-yl]ethyl acetate::CHEMBL311283
SMILES: COC(=O)C12O[C@@H]1C(=C)C[C@@]1(O)[C@@H]3CC[C@@]4(C)[C@@H]5C=CC(=O)OC[C@]5(C(C)OC(C)=O)[C@@H](OC(C)=O)[C@@H](OC(C)=O)[C@@H]4[C@@]3(C)[C@H](OC(C)=O)[C@H](OC(C)=O)[C@@]21C
InChI Key: InChIKey=VKDXHXWBOARFPD-GMNMBZFNSA-N
Data: 1 Kd
Activity Spreadsheet -- Enzyme Inhibition Constant Data from BindingDB
Found 1 hit for monomerid = 50145062
Trg + Lig
Ki
nM
ΔG°
kcal/mole
IC50
nM
Kd
nM
EC50/IC50
nM
koff
s-1
kon
M-1s-1
pHTemp
°C
Voltage-gated potassium channel
(Homo sapiens (Human))
BDBM50145062
(1-[12b-hydroxy-1b,3a,10b-trimethyl-2,3,4,5-tetra(m...)
Show SMILES COC(=O)C12O[C@@H]1C(=C)C[C@@]1(O)[C@@H]3CC[C@@]4(C)[C@@H]5C=CC(=O)OC[C@]5(C(C)OC(C)=O)[C@@H](OC(C)=O)[C@@H](OC(C)=O)[C@@H]4[C@@]3(C)[C@H](OC(C)=O)[C@H](OC(C)=O)[C@@]21C |c:19|
Show InChI InChI=1S/C40H52O16/c1-18-16-39(48)26-14-15-35(8)25-12-13-27(46)50-17-38(25,19(2)51-20(3)41)31(53-22(5)43)28(52-21(4)42)29(35)36(26,9)32(54-23(6)44)33(55-24(7)45)37(39,10)40(30(18)56-40)34(47)49-11/h12-13,19,25-26,28-33,48H,1,14-17H2,2-11H3/t19?,25-,26+,28-,29-,30+,31-,32+,33-,35-,36-,37+,38+,39+,40?/m0/s1
Reactome pathway
n/an/an/a 100n/an/an/an/an/a
Institute of Medical Research Biotechnology Centre
Curated by ChEMBL
Assay Description
Dissociation constant for the blockage of voltage-gated potassium channel subunit Kv1.3 in human lymphocytes
J Med Chem 47: 2326-36 (2004)
Article DOI: 10.1021/jm030523s
BindingDB Entry DOI: 10.7270/Q28W3CRM