BDBM50145066 1-(6-Hydroxy-4,7-dimethoxy-benzofuran-5-yl)-ethanone::1-(6-hydroxy-4,7-dimethoxybenzofuran-5-yl)ethanone::CHEMBL78293
SMILES: COc1c(O)c(C(C)=O)c(OC)c2ccoc12
InChI Key: InChIKey=GEUAWNMVARSYHO-UHFFFAOYSA-N
Data: 1 Kd  1 EC50
Activity Spreadsheet -- Enzyme Inhibition Constant Data from BindingDB
Found 2 hits for monomerid = 50145066
Trg + Lig
Ki
nM
ΔG°
kcal/mole
IC50
nM
Kd
nM
EC50/IC50
nM
koff
s-1
kon
M-1s-1
pHTemp
°C
Voltage-gated potassium channel subunit Kv1.3
(Mus musculus)
BDBM50145066
(1-(6-Hydroxy-4,7-dimethoxy-benzofuran-5-yl)-ethano...)
Show SMILES COc1c(O)c(C(C)=O)c(OC)c2ccoc12
Show InChI InChI=1S/C12H12O5/c1-6(13)8-9(14)12(16-3)11-7(4-5-17-11)10(8)15-2/h4-5,14H,1-3H3
Reactome pathway
n/an/an/an/a 4.50E+4n/an/an/an/a
Institute of Medical Research Biotechnology Centre
Curated by ChEMBL
Assay Description
Effect on blockade of mouse Kv1.3 channel expressed in L929 cells
J Med Chem 49: 1433-41 (2006)
Article DOI: 10.1021/jm050839v
BindingDB Entry DOI: 10.7270/Q2KW5FM6
Voltage-gated potassium channel
(Homo sapiens (Human))
BDBM50145066
(1-(6-Hydroxy-4,7-dimethoxy-benzofuran-5-yl)-ethano...)
Show SMILES COc1c(O)c(C(C)=O)c(OC)c2ccoc12
Show InChI InChI=1S/C12H12O5/c1-6(13)8-9(14)12(16-3)11-7(4-5-17-11)10(8)15-2/h4-5,14H,1-3H3
Reactome pathway
n/an/an/a 5.00E+4n/an/an/an/an/a
Institute of Medical Research Biotechnology Centre
Curated by ChEMBL
Assay Description
Dissociation constant for the blockage of voltage-gated potassium channel subunit Kv1.3 in human lymphocytes
J Med Chem 47: 2326-36 (2004)
Article DOI: 10.1021/jm030523s
BindingDB Entry DOI: 10.7270/Q28W3CRM