null
SMILES: COc1c2OCCc2c(OC)c(C(=O)CCc2ccccc2)c1O
InChI Key: InChIKey=ZWGHMAYSIBSWSW-UHFFFAOYSA-N
Activity Spreadsheet -- Enzyme Inhibition Constant Data from BindingDB
Found 1 hit for monomerid = 50145069
Trg + Lig
Ki
nM
ΔG°
kcal/mole
IC50
nM
Kd
nM
EC50/IC50
nM
koff
s-1
kon
M-1s-1
pHTemp
°C
Potassium voltage-gated channel subfamily A member 3
(Homo sapiens (Human))
BDBM50145069
(1-(6-Hydroxy-4,7-dimethoxy-2,3-dihydro-benzofuran-...)
Show SMILES COc1c2OCCc2c(OC)c(C(=O)CCc2ccccc2)c1O
Show InChI InChI=1S/C19H20O5/c1-22-17-13-10-11-24-18(13)19(23-2)16(21)15(17)14(20)9-8-12-6-4-3-5-7-12/h3-7,21H,8-11H2,1-2H3
Reactome pathway
n/an/an/a 1.50E+3n/an/an/an/an/a
Institute of Medical Research Biotechnology Centre
Curated by ChEMBL
Assay Description
Dissociation constant for the blockage of voltage-gated potassium channel subunit Kv1.3 in human lymphocytes
J Med Chem 47: 2326-36 (2004)
Article DOI: 10.1021/jm030523s
BindingDB Entry DOI: 10.7270/Q28W3CRM