BDBM50145135 CHEMBL3764188
SMILES: Cn1nccc1C1C(Nc2cc(F)cc3c2c1n[nH]c3=O)c1ccc(F)cc1
InChI Key: InChIKey=BVGJIMWIYVYPEI-UHFFFAOYSA-N
Data: 1 IC50  1 EC50
Activity Spreadsheet -- Enzyme Inhibition Constant Data from BindingDB
Found 2 hits for monomerid = 50145135
Trg + Lig
Ki
nM
ΔG°
kcal/mole
IC50
nM
Kd
nM
EC50/IC50
nM
koff
s-1
kon
M-1s-1
pHTemp
°C
Poly [ADP-ribose] polymerase 1
(Homo sapiens (Human))
BDBM50145135
(CHEMBL3764188)
Show SMILES Cn1nccc1C1C(Nc2cc(F)cc3c2c1n[nH]c3=O)c1ccc(F)cc1
Show InChI InChI=1S/C20H15F2N5O/c1-27-15(6-7-23-27)17-18(10-2-4-11(21)5-3-10)24-14-9-12(22)8-13-16(14)19(17)25-26-20(13)28/h2-9,17-18,24H,1H3,(H,26,28)
n/an/an/an/a 9.30n/an/an/an/a
BioMarin Pharmaceutical Inc.
Curated by ChEMBL
Assay Description
Inhibition of PARP in human LoVo cells assessed as inhibition of poly(ADP)-ribose polymerization for 30 mins by fluorescence assay
J Med Chem 59: 335-57 (2016)
BindingDB Entry DOI: 10.7270/Q2K35WJR
Poly [ADP-ribose] polymerase 1
(Homo sapiens (Human))
BDBM50145135
(CHEMBL3764188)
Show SMILES Cn1nccc1C1C(Nc2cc(F)cc3c2c1n[nH]c3=O)c1ccc(F)cc1
Show InChI InChI=1S/C20H15F2N5O/c1-27-15(6-7-23-27)17-18(10-2-4-11(21)5-3-10)24-14-9-12(22)8-13-16(14)19(17)25-26-20(13)28/h2-9,17-18,24H,1H3,(H,26,28)
n/an/a 1.80n/an/an/an/an/an/a
BioMarin Pharmaceutical Inc.
Curated by ChEMBL
Assay Description
Inhibition of human PARP1 using [3H]NAD as substrate after 1 min by microplate scintillation counting analysis
J Med Chem 59: 335-57 (2016)
BindingDB Entry DOI: 10.7270/Q2K35WJR