BDBM50145162 CHEMBL3764508
SMILES: Brc1ccc(NNS(=O)(=O)c2ccc3[nH]c(=O)ccc3c2)cc1
InChI Key: InChIKey=WCZLYMAUPIMXLP-UHFFFAOYSA-N
Data: 1 IC50  1 EC50
Activity Spreadsheet -- Enzyme Inhibition Constant Data from BindingDB
Found 2 hits for monomerid = 50145162
Trg + Lig
Ki
nM
ΔG°
kcal/mole
IC50
nM
Kd
nM
EC50/IC50
nM
koff
s-1
kon
M-1s-1
pHTemp
°C
Indoleamine 2,3-dioxygenase
(Homo sapiens (Human))
BDBM50145162
(CHEMBL3764508)
Show SMILES Brc1ccc(NNS(=O)(=O)c2ccc3[nH]c(=O)ccc3c2)cc1
Show InChI InChI=1S/C15H12BrN3O3S/c16-11-2-4-12(5-3-11)18-19-23(21,22)13-6-7-14-10(9-13)1-8-15(20)17-14/h1-9,18-19H,(H,17,20)
Reactome pathway
n/an/a 85n/an/an/an/an/an/a
National Health Research Institutes
Curated by ChEMBL
Assay Description
Inhibition of human Indoleamine 2,3-dioxygenase using L-tryptophan as substrate by emission fluorescence analysis
J Med Chem 59: 419-30 (2016)
BindingDB Entry DOI: 10.7270/Q2FF3V69
Indoleamine 2,3-dioxygenase
(Homo sapiens (Human))
BDBM50145162
(CHEMBL3764508)
Show SMILES Brc1ccc(NNS(=O)(=O)c2ccc3[nH]c(=O)ccc3c2)cc1
Show InChI InChI=1S/C15H12BrN3O3S/c16-11-2-4-12(5-3-11)18-19-23(21,22)13-6-7-14-10(9-13)1-8-15(20)17-14/h1-9,18-19H,(H,17,20)
Reactome pathway
n/an/an/an/a 212n/an/an/an/a
National Health Research Institutes
Curated by ChEMBL
Assay Description
Inhibition of Indoleamine 2,3-dioxygenase in human HeLa cells in presence of L-tryptophan as substrate after 24 hrs in presence of L-tryptophan
J Med Chem 59: 419-30 (2016)
BindingDB Entry DOI: 10.7270/Q2FF3V69